program: Gaussian 16
title: [6+4] or [2+4} they proposed ts guess
version: ES64L-G16RevC.01
frameworkgroup: C1[X(C7H14N)]
method: RM062X
basis: def2SVP
operation: Freq
keyword: #N
keyword: Geom=AllCheck
keyword: Guess=TCheck
keyword: SCRF=Check
keyword: GenChk
keyword: RM062X/def2SVP
keyword: Freq
converged: YES YES YES YES
title: Mulliken charges:
elementType: C C C C C H H H H H N C H H H C H H H H H H
charge: 0.095027 -0.083353 -0.047068 0.003011 -0.053478 0.076196 0.101955 0.098475 0.101596 0.068949 -0.275774 0.042531 0.103153 0.105789 0.117238 -0.018160 0.086018 0.109908 0.127655 0.064477 0.065653 0.110203
chargesum: 1.00000
title: Mulliken charges with hydrogens summed into heavy atoms:
elementType: C C C C C N C C
charge: 0.295457 0.061791 0.083062 0.214809 -0.053478 -0.275774 0.368711 0.305420
1716.lowfreq: -14.2038 0.0006 0.0007 0.0008 17.7623 32.6613 101.2795 126.4436 164.6140
frequency: 101.1351 126.2871 164.3257 176.5578 302.3227 325.6482 381.9781 407.4432 459.7218 475.7734 543.1908 615.8826 713.1004 805.1985 865.6352 893.5962 913.6149 967.8422 996.1929 1028.1336 1063.3876 1097.2192 1113.2338 1132.7073 1161.8284 1188.3301 1203.8214 1223.2888 1267.5446 1278.6758 1306.4382 1351.2419 1359.3877 1379.1511 1394.1890 1397.9894 1413.3301 1427.6837 1430.7611 1442.0967 1448.8255 1454.1604 1460.0326 1476.4882 1484.6594 1777.1192 3063.7987 3074.6496 3083.6613 3089.0857 3099.7034 3102.6169 3128.1629 3156.0376 3158.3532 3166.6737 3168.9628 3205.2061 3210.4202 3237.3923
redmass: 1.1782 1.3848 2.1978 1.3129 2.0344 1.7619 2.6701 2.4578 2.5440 2.7293 2.9627 1.9797 3.2515 1.5494 1.7888 1.4428 2.1296 2.1063 1.3922 1.4711 1.5365 1.4672 1.6171 1.5312 2.6700 1.5884 1.8591 1.5328 1.2709 1.6296 1.2202 1.4140 1.2549 1.1756 1.6053 1.4415 1.2451 1.1450 1.2426 1.0913 1.1125 1.0698 1.1300 1.8850 1.0815 7.3334 1.0686 1.0409 1.0689 1.0645 1.0385 1.0609 1.0969 1.1017 1.1048 1.0994 1.1076 1.1062 1.1071 1.1084
irintensity: 0.0285 0.3857 0.2798 1.8597 9.8349 3.7448 0.5104 0.0962 1.8173 0.7697 1.1370 5.1824 4.4473 3.4884 4.1100 3.5912 2.0514 4.4012 22.0598 3.2286 11.9531 9.5178 6.4241 5.2818 1.8531 1.4514 6.3147 2.7978 9.1670 26.1852 13.4351 10.3915 26.1711 54.9459 5.1002 9.3057 16.9989 4.9123 28.8187 12.1618 9.5741 20.7687 3.1564 59.1940 21.1779 223.4138 10.0923 3.0616 11.9056 40.5971 1.3406 11.0021 1.1213 13.5591 20.7800 2.6910 7.2597 0.9801 1.3519 0.3374
temp: 298.150 k
press: 1.00000 atm
elementType: 6 6 6 6 6 1 1 1 1 1 7 6 1 1 1 6 1 1 1 1 1 1
symmnumber: 1
zpe: 537972.0 jmol-1
zpe.correction: 0.204903 hartree
zpe.thermalcorrener: 0.213417 hartree
zpe.thermalcorrenthalpy: 0.214361 hartree
zpe.thermalcorrgfe: 0.172255 hartree
zpe.sumelectzpe: -329.173644 hartree
zpe.sumelectthermal: -329.165130 hartree
zpe.sumelectthermalent: -329.164186 hartree
zpe.sumelectthermalfe: -329.206291 hartree
dipole: 2.5047 0.4320 0.0466
dipole: 2.5422
quadrupole: -36.0332 -36.5917 -46.6091
quadrupole: 0.2189 0.2627 0.4498
quadrupole: 3.7115 3.1530 -6.8645 0.2189 0.2627 0.4498
hfenergy: -329.3785462 hartree
pointgroup: C01 [X(C7H14N1)]
dipole: -0.7896447 -0.5160867 -0.3323213 debye
dipolederiv: 0.6367344 0.0211077 -0.1258846 0.1397864 0.2314436 -0.1271389 -0.0604172 -0.0650494 0.1508859 -0.0267848 -0.009414 0.0514085 -0.0338094 0.1028038 -0.0275551 0.0169732 -0.0488943 0.0521432 0.1012546 -0.0162945 0.0023445 -0.0408731 0.0998144 -0.041692 0.0137946 -0.0529037 0.0485658 0.0244002 -0.0138209 0.0627155 -0.0509606 -0.2175703 -0.2631806 -0.0046113 -0.164351 -0.1943748 0.8304397 0.0192883 -0.3165827 -0.0133919 0.6074235 0.4762337 -0.3185592 0.4780223 0.9762832 -0.1126232 -0.0115818 0.0621574 -0.0025825 0.0914941 -0.0126174 0.0446227 -0.0159209 0.0645096 -0.0207913 0.0228048 0.0627992 0.0108568 -0.0518718 0.0452006 -0.0118026 0.0569726 0.0956577 0.0148975 -0.004643 -0.0400072 -0.0375909 0.1124181 0.0052455 0.0023981 -0.0227651 -0.0582074 0.0263008 -0.0803766 0.0092572 -0.0371032 0.1367598 0.0535385 0.0667392 0.0096055 0.0073034 0.0597768 0.0774348 -0.0544967 0.0269914 -0.0974408 0.0641277 -0.038234 0.061066 -0.0086493 -0.6726224 0.0330312 0.2381298 0.0260476 -0.5451058 -0.3349868 0.2381659 -0.2820504 -0.7330051 0.0967034 0.0869324 0.1500355 0.0824545 0.3227397 0.2263223 0.1533362 0.0925674 0.2130477 0.0238808 0.0579677 0.0079302 0.0201259 0.0632937 -0.0779429 -0.0155237 -0.0346528 0.1083545 0.0594576 -0.0700597 0.0038313 -0.0466156 0.0810057 -0.0430359 0.047614 0.0124897 0.0195046 0.1128674 -0.0323988 -0.0769213 0.0226158 -0.0107072 0.0044472 -0.0482059 -0.002035 0.0341773 -0.3827081 -0.0803836 0.0709852 -0.2594191 -0.110312 0.1335613 0.0006639 0.0029219 -0.1267389 0.0776284 -0.0042071 0.0137576 0.045026 0.0575604 -0.093045 0.0136897 -0.0710674 0.0723887 0.0484217 0.0077455 0.002765 0.032385 0.1459473 -0.0183817 -0.0206743 0.0041146 0.0103221 0.0639275 0.036749 0.0482753 0.0440221 0.0493795 0.0206665 0.0112983 0.0299617 0.1426453 0.0084692 -0.0703036 -0.0478567 -0.0892452 -0.0268247 -0.101103 -0.0407595 -0.0882522 0.0098108 0.0031372 0.046194 -0.0167709 0.0908768 -0.0691937 0.1077037 -0.0140044 0.0765535 0.0094542 0.0272325 -0.0157717 -0.1078721 0.0704031 0.0269428 0.0036321 -0.0365036 0.0236671 0.1059214 unknown
polarizability: 110.2995098|0.2342091|100.2092606|-7.9163007|14.4993689|111.8581167 unknown
InChI: InChI=1S/C7H14N/c1-7-5-3-4-6-8(7)2/h3-6H2,1-2H3
charge 1 multiplicity 1
22 atoms
C  -4.27426798 1.56439952 -1.6385295
C  -3.63277 2.7781178 -1.00284587
C  -3.94919392 2.80185721 0.48457802
C  -5.45568422 2.88830461 0.66110219
C  -6.24116562 1.99987915 -0.2459878
H  -2.55210887 2.73106317 -1.18969161
H  -3.75418663 0.63611991 -1.35956468
H  -4.2728347 1.63074649 -2.73410198
H  -5.77964381 2.65233861 1.68613564
H  -4.01500049 3.69350008 -1.48090592
N  -5.69102 1.39089955 -1.24503568
C  -6.43990542 0.47727301 -2.11247521
H  -5.73290763 -0.24931705 -2.52660414
H  -7.20945841 -0.05152017 -1.5435184
H  -6.89938868 1.04492946 -2.93294644
C  -7.69383482 1.83329896 0.03673541
H  -8.01842174 2.58678911 0.76201416
H  -8.29311305 1.91199402 -0.87951448
H  -7.86269036 0.83489943 0.47168546
H  -3.46882891 3.6529213 0.98302885
H  -3.570731 1.88266655 0.95764105
H  -5.82982369 3.90882984 0.46368519
