program: Gaussian 16
title: [6+4] or [2+4} they proposed ts guess
version: ES64L-G16RevC.01
frameworkgroup: C1[X(C8H15N)]
method: RM062X
basis: def2SVP
operation: Freq
keyword: #N
keyword: Geom=AllCheck
keyword: Guess=TCheck
keyword: SCRF=Check
keyword: GenChk
keyword: RM062X/def2SVP
keyword: Freq
converged: YES YES YES YES
title: Mulliken charges:
elementType: C C C C C H H H H H H N C H H H C H H H C H H H
charge: 0.097933 0.002102 -0.316385 -0.106946 0.036938 0.039121 0.045476 0.049537 0.024312 0.045317 0.028550 -0.388198 0.045564 0.059359 0.062755 0.038606 -0.007140 0.042684 0.040817 0.038511 0.004257 0.039526 0.037708 0.039595
chargesum: -0.00000
title: Mulliken charges with hydrogens summed into heavy atoms:
elementType: C C C C C N C C C
charge: 0.192946 0.069773 -0.316385 -0.082634 0.082256 -0.388198 0.206283 0.114872 0.121087
chargesum: 0.00000
1716.lowfreq: -14.4474 -0.0009 -0.0006 0.0006 7.3743 14.6208 59.7613 169.4421 199.4760
frequency: 59.7478 169.4416 199.4758 244.1293 248.5449 282.2337 318.9154 332.2898 368.0684 399.3431 429.1398 471.9371 520.0843 598.7630 714.9575 745.8990 779.3989 804.3140 905.5410 945.3273 955.3184 983.7439 987.4679 1000.3363 1016.8670 1043.5959 1079.8655 1136.6999 1153.1227 1167.8996 1188.8283 1228.2596 1266.8398 1281.3861 1328.3835 1356.7793 1362.2866 1372.0511 1382.2125 1384.3241 1422.5001 1434.1247 1440.7297 1446.6869 1448.6915 1451.8597 1455.5115 1460.2176 1472.3277 1491.0371 1731.9184 3013.7614 3044.8913 3047.1062 3054.8417 3063.4650 3115.2581 3121.1015 3132.0173 3135.6921 3140.8628 3145.6086 3149.5116 3168.8937 3180.0468 3199.5422
redmass: 2.7505 2.6833 1.7669 1.2396 1.0592 1.2056 1.8981 2.4869 2.0346 1.9494 2.0441 3.4006 2.8866 3.0753 3.5681 2.0205 1.6430 2.8823 1.7220 1.4506 1.7636 1.5078 1.3244 1.5293 1.9322 1.6195 1.6570 1.3158 1.6688 1.2746 1.8709 2.4994 1.9309 1.7239 1.8875 1.5770 2.3120 1.3735 1.3053 1.4403 1.3601 1.1428 1.0473 1.1134 1.1550 1.0705 1.1107 1.0910 1.1421 1.2289 7.0449 1.0493 1.0363 1.0394 1.0620 1.0679 1.1043 1.0881 1.1041 1.1042 1.1046 1.1000 1.1029 1.1063 1.0871 1.0981
irintensity: 5.7188 11.9270 0.2929 1.1623 0.7430 0.3780 0.7483 4.0937 12.6378 0.6864 3.0002 3.4661 5.1562 16.8664 8.2061 18.5179 63.1690 21.8077 1.5008 1.4106 17.2615 13.3708 24.8541 8.5705 15.0173 14.7424 34.5883 5.7753 87.8966 3.5530 24.7128 23.3811 3.3786 5.8291 31.0181 31.4941 58.5841 12.3809 1.7091 10.0176 48.2927 10.5328 0.5662 4.6005 6.0569 27.9547 21.0801 10.9106 10.7487 34.8954 199.4502 126.7967 35.6882 48.3895 40.7862 75.9128 58.8335 47.3349 23.3693 64.7071 49.6480 52.3244 26.4698 29.5652 6.2322 29.7260
temp: 298.150 k
press: 1.00000 atm
elementType: 6 6 6 6 6 1 1 1 1 1 1 7 6 1 1 1 6 1 1 1 6 1 1 1
symmnumber: 1
zpe: 575296.3 jmol-1
zpe.correction: 0.219119 hartree
zpe.thermalcorrener: 0.228637 hartree
zpe.thermalcorrenthalpy: 0.229582 hartree
zpe.thermalcorrgfe: 0.185405 hartree
zpe.sumelectzpe: -367.942954 hartree
zpe.sumelectthermal: -367.933435 hartree
zpe.sumelectthermalent: -367.932491 hartree
zpe.sumelectthermalfe: -367.976668 hartree
dipole: 0.7907 -0.8121 1.0555
dipole: 1.5488
quadrupole: -53.9167 -55.3016 -60.4685
quadrupole: 0.3640 1.9331 -0.6305
quadrupole: 2.6456 1.2607 -3.9062 0.3640 1.9331 -0.6305
hfenergy: -368.1620724 hartree
pointgroup: C01 [X(C8H15N1)]
dipole: 0.1125605 -0.0555846 -0.5962858 debye
dipolederiv: 0.6554997 -0.1461217 -0.0203833 -0.0383815 0.3736429 -0.087231 -0.0044875 -0.1267053 0.2021431 0.064659 0.0128004 -0.0064282 -0.0687007 -0.0659228 -0.0538526 -0.0041371 -0.0336274 0.0682326 0.1546036 0.0731978 0.1258719 -0.0281054 0.1500401 -0.0910089 0.0486774 -0.1274497 0.1380607 -0.0543089 -0.113638 -0.2256157 0.0182642 -0.4624767 0.0433176 -0.1945487 -0.0062289 -0.531632 0.1404511 -0.1292836 -0.3008141 0.2257516 0.9117601 0.9182615 -0.0341246 0.8107731 0.6967308 -0.222061 0.0001049 0.0552433 -0.0105113 0.0816321 -0.0055224 0.0201131 -0.0015275 0.0693227 -0.043679 0.0593024 -0.0279592 0.0461946 -0.049185 0.1226148 -0.1094335 0.1687775 -0.054746 0.0432529 0.0088181 0.015203 0.0175989 0.0012619 -0.1086574 0.063405 -0.1379038 -0.0973128 0.0009804 0.0248174 0.0894842 0.0210875 0.0620481 -0.1330324 0.1181777 -0.12255 0.0186356 -0.1345077 -0.0164719 0.053468 -0.062784 0.0706245 -0.0949684 0.0416755 0.0068423 0.1817209 0.0349354 0.0564932 -0.0908753 0.0367962 -0.0615541 0.120345 -0.0552935 0.0874334 -0.1181709 -0.7963623 0.1682009 0.1002259 -0.2960126 -1.3491736 -0.8210974 -0.1255642 -0.4911803 -1.1440619 0.3602065 0.2148603 0.3791402 0.1150374 0.4722637 0.109135 0.2969493 0.0437544 0.802244 0.0666529 0.0696587 0.0227138 0.0447864 -0.1069616 -0.1148337 -0.0449511 -0.1004544 -0.0459507 -0.1521972 -0.0367888 -0.0123473 -0.0017126 0.1016591 0.0087276 0.0501714 -0.0028242 0.0274913 0.0227362 -0.1038489 -0.0170505 -0.010261 -0.098959 0.2252642 -0.0873845 0.0037523 -0.2129958 0.044865 -0.0574883 -0.0655695 0.0223953 0.0658864 0.0446314 -0.0078842 0.0233086 0.1095882 0.0701703 0.0337274 0.0682431 0.0043168 -0.0286881 -0.0875638 0.0515968 -0.1363782 -0.1354598 -0.1879678 -0.0981515 0.0357663 -0.0605348 -0.0058509 -0.0280414 0.0465102 0.0075646 0.0754162 0.0033204 0.0778578 -0.1164802 0.0412383 -0.0109303 0.0661686 -0.1026327 0.1070652 -0.0623434 0.0507216 -0.0512098 -0.0761734 0.0038848 0.0074938 -0.0081333 0.0033887 0.0700992 0.0735012 -0.2359304 -0.0713153 -0.0423846 -0.053995 0.0849536 0.0282783 0.0194145 0.002921 0.0277372 0.0500468 0.0508534 0.071875 0.032687 0.0364801 -0.1008101 0.026805 -0.0668377 -0.1612756 0.0639125 -0.0263748 -0.0151534 0.0009599 -0.1800443 0.0480091 -0.0164429 0.0213757 0.0731242 unknown
polarizability: 132.9068507|8.8637269|129.572981|8.7798456|20.7106958|134.0234518 unknown
InChI: InChI=1S/C8H15N/c1-8(2)4-6-9(3)7-5-8/h4,6H,5,7H2,1-3H3
charge 0 multiplicity 1
24 atoms
C  -4.26243168 1.08186717 -1.28302711
C  -3.67894862 2.4863856 -1.16655354
C  -4.05460675 3.13261201 0.17743939
C  -5.52933256 2.8870178 0.41291696
C  -6.24991056 1.99524644 -0.29079278
H  -2.58394249 2.45038703 -1.27857869
H  -3.84803833 0.44958688 -0.4799924
H  -3.97540438 0.61571256 -2.23446941
H  -6.0399713 3.50035226 1.16074373
H  -7.33592911 1.9296627 -0.16552675
H  -4.07609407 3.10765872 -1.98732293
N  -5.72081118 1.07081699 -1.18863344
C  -6.42828528 0.96564416 -2.45321551
H  -6.13420636 0.04622537 -2.97721903
H  -7.5103655 0.92187232 -2.26623117
H  -6.23497058 1.82443196 -3.12356158
C  -3.80589294 4.64339158 0.10744896
H  -4.06863098 5.12622856 1.06164194
H  -2.7446217 4.85254201 -0.09904997
H  -4.41019518 5.10543602 -0.68792803
C  -3.20943765 2.55099765 1.31942201
H  -2.14376142 2.78940715 1.17140009
H  -3.52297169 2.97550613 2.28567091
H  -3.31465877 1.45829438 1.38531304
