program: Gaussian 16
title: [6+4] or [2+4} they proposed ts guess
version: ES64L-G16RevC.01
frameworkgroup: C1[X(C5H6N)]
method: RM062X
basis: def2SVP
operation: Freq
keyword: #N
keyword: Geom=AllCheck
keyword: Guess=TCheck
keyword: SCRF=Check
keyword: GenChk
keyword: RM062X/def2SVP
keyword: Freq
converged: YES YES YES YES
title: Mulliken charges:
elementType: C C C C C N H H H H H H
charge: 0.142676 -0.059217 0.078905 -0.059215 0.142674 -0.053440 0.100804 0.126383 0.101636 0.101636 0.126382 0.250775
chargesum: 1.00000
title: Mulliken charges with hydrogens summed into heavy atoms:
elementType: C C C C C N
charge: 0.269059 0.042419 0.179709 0.042422 0.269056 0.197335
1716.lowfreq: -48.1039 -21.5958 -18.8431 -0.0011 -0.0009 -0.0008 398.5768 409.0975 615.0293
frequency: 398.5326 409.0951 615.0293 641.2249 674.8142 751.3519 855.9487 901.2596 1027.3722 1027.9297 1036.2611 1056.7475 1068.6138 1083.1767 1087.6016 1150.2019 1204.3466 1262.0719 1365.6858 1383.7513 1524.2777 1569.6906 1690.0380 1721.9764 3250.8446 3269.1320 3270.5063 3288.0206 3289.2202 3534.0870
redmass: 2.9046 2.7494 6.1268 6.0679 1.4127 1.9127 1.2326 1.2468 1.3220 5.4810 1.4045 4.5904 1.3670 1.6158 1.5402 1.0665 1.1872 1.1516 2.9730 1.6233 2.2902 2.1696 6.0195 5.7336 1.0935 1.0950 1.0985 1.0999 1.1022 1.0827
irintensity: 2.1934 0.0000 0.0000 0.6007 194.6902 64.4686 4.5548 0.0000 1.4120 6.3315 0.0000 0.1223 0.8565 15.3459 23.9109 7.4264 5.1731 11.3848 36.2934 11.1586 38.8866 115.9804 40.9410 74.1266 0.0119 2.6691 11.2840 30.8303 6.9384 400.9893
temp: 298.150 k
press: 1.00000 atm
elementType: 6 6 6 6 6 7 1 1 1 1 1 1
symmnumber: 1
zpe: 271605.0 jmol-1
zpe.correction: 0.103449 hartree
zpe.thermalcorrener: 0.107805 hartree
zpe.thermalcorrenthalpy: 0.108749 hartree
zpe.thermalcorrgfe: 0.075967 hartree
zpe.sumelectzpe: -248.345601 hartree
zpe.sumelectthermal: -248.341245 hartree
zpe.sumelectthermalent: -248.340301 hartree
zpe.sumelectthermalfe: -248.373083 hartree
dipole: -2.8923 -0.0000 -0.0001
dipole: 2.8923
quadrupole: -16.4668 -21.1079 -36.2054
quadrupole: 0.0001 0.0010 -0.0021
quadrupole: 8.1266 3.4855 -11.6120 0.0001 0.0010 -0.0021
hfenergy: -248.4490499 hartree
pointgroup: C01 [X(C5H6N1)]
dipole: -1.1371665 -0.041491 0.0000474 debye
dipolederiv: 0.4838025 0.4194596 -0.0000733 -0.1895705 -0.0027231 0.0000223 0.0000114 -0.0000107 0.0942859 -0.34381 -0.611658 0.0000959 -0.2192518 -0.2581449 0.0000316 0.0000364 0.0000507 -0.122336 0.3472064 -0.0053947 -0.0000092 -0.0053929 0.494805 -0.0000712 -0.000011 -0.0000721 -0.0040423 -0.4037515 0.6010192 -0.0000818 0.208612 -0.1982075 0.0000032 -0.0000193 -0.000023 -0.1223338 0.4979272 -0.3828738 0.0000367 0.2261533 -0.0168444 0.000002 -0.0000567 0.0000408 0.0942869 -0.8247841 -0.029892 0.0000349 -0.0298852 -0.0067328 -0.0000274 0.0000442 -0.0000197 -0.1773124 0.0708819 -0.003 0.0000021 -0.0029991 0.1529916 -0.0000001 0.0000082 -0.0000003 0.1523844 0.1350966 -0.0052248 0.0000033 0.0249334 0.1821474 0.0000005 -0.0000031 -0.0000023 0.1848514 0.1476729 0.016284 -0.0000011 0.0179152 0.0964546 0.0000103 -0.0000035 0.0000115 0.1732306 0.1498876 -0.0123778 0.0000028 -0.0140117 0.0942411 0.0000127 0.0000023 0.0000153 0.1732306 0.136778 0.0019108 0.0000011 -0.0282477 0.1804627 0.0000041 0.0000095 -0.0000022 0.1848509 0.6030924 0.0117473 -0.0000115 0.0117451 0.2815502 0.0000119 -0.0000185 0.0000119 0.3689039 unknown
polarizability: 88.9734837|-0.1805021|93.9128802|-0.0023213|-0.0085821|32.3526678 unknown
InChI: InChI=1S/C5H6N/c1-2-4-6-5-3-1/h1-6H
charge 1 multiplicity 1
12 atoms
C  -3.13052249 -2.77596718 -0.94192095
C  -1.74788502 -2.75182797 -0.94198732
C  -1.0948806 -1.51889901 -0.94217581
C  -1.83600122 -0.33684018 -0.94232139
C  -3.21672154 -0.41353276 -0.94225363
N  -3.80887917 -1.61792854 -0.94204967
H  -0.00488905 -1.47913443 -0.94223785
H  -3.72297239 -3.68971059 -0.94176884
H  -1.19648019 -3.69061716 -0.9418878
H  -1.35449144 0.63964363 -0.94248439
H  -3.874188 0.45460341 -0.94234219
H  -4.83158813 -1.65524181 -0.94200378
