program: Gaussian 16
title: Title Card Required
version: ES64L-G16RevA.03
method: UwB97XD
basis: def2SVP
operation: Freq
keyword: #P
keyword: Geom=AllCheck
keyword: Guess=TCheck
keyword: SCRF=Check
keyword: GenChk
keyword: UwB97XD/def2SVP
keyword: Freq
converged: YES YES YES YES
polarizability: 2.68454743e+01 -3.99455517e-10 2.68454743e+01 -3.82678999e-08 -1.37949561e-07 1.76286789e+01
1716.lowfreq: -47.6545 -47.6545 -43.0337 -0.0034 -0.0032 -0.0023 227.9481 341.3910 341.3910
frequency: 227.9481 341.3834 341.3834 440.7085 503.2970 503.2970 531.0458 609.8818 649.8913 853.5341 853.5341 903.2900
redmass: 18.9984 19.1109 19.1109 18.9984 19.6165 19.6165 21.5819 18.9984 19.0929 25.7467 25.7467 23.1389
irintensity: 0.0000 0.1392 0.1392 0.0000 8.1687 8.1687 48.4191 0.0000 11.0092 581.1520 581.1520 192.3288
temp: 298.150 k
press: 1.00000 atm
elementType: 16 9 9 9 9 9
symmnumber: 1
zpe: 40429.0 jmol-1
zpe.correction: 0.015399 hartree
zpe.thermalcorrener: 0.020880 hartree
zpe.thermalcorrenthalpy: 0.021824 hartree
zpe.thermalcorrgfe: -0.014667 hartree
zpe.sumelectzpe: -896.570601 hartree
zpe.sumelectthermal: -896.565120 hartree
zpe.sumelectthermalent: -896.564176 hartree
zpe.sumelectthermalfe: -896.600667 hartree
dipole: -0.0000 -0.0000 -0.6386
dipole: 0.6386
quadrupole: -39.3445 -39.3445 -35.3615
quadrupole: 0.0000 0.0000 0.0000
quadrupole: -1.3277 -1.3277 2.6553 0.0000 0.0000 0.0000
hfenergy: -896.5859993 hartree
pointgroup: C01 [X(F5S1)]
dipole: 0. 0. -0.2512594 debye
dipolederiv: 3.6674829 0. 0. 0. 3.6674829 0. 0. 0. 2.4185812 -0.4046874 0. 0. 0. -1.2157878 0.0539689 0. -0.1255609 -0.3721892 -1.2157878 0. 0.0539689 0. -0.4046874 0. -0.1255609 0. -0.3721892 -0.4046874 0. 0. 0. -1.2157879 -0.0539688 0. 0.1255609 -0.3721892 -1.2157879 0. -0.0539688 0. -0.4046874 0. 0.1255609 0. -0.3721892 -0.4265324 0. 0. 0. -0.4265324 0. 0. 0. -0.9298243 unknown
polarizability: 26.8454743|0.|26.8454743|0.|-0.0000001|17.6286789 unknown
InChI: InChI=1S/F5S/c1-6(2,3,4)5
charge 0 multiplicity 2
6 atoms
S  -0.0000 -0.00000002 -0.20830936
F  0.00000001 1.6228904 -0.24778458
F  1.62289041 0.00000004 -0.24778457
F  0.00000001 -1.62289043 -0.24778456
F  -1.62289042 0.00000004 -0.24778457
F  -0.0000 -0.00000002 1.36199704
