program: Gaussian 16
title: Title Card Required
version: ES64L-G16RevA.03
frameworkgroup: C1[X(C10H10F5O2S2)]
method: UwB97XD
basis: def2SVP
operation: Freq
keyword: #P
keyword: Geom=AllCheck
keyword: Guess=TCheck
keyword: SCRF=Check
keyword: GenChk
keyword: UwB97XD/def2SVPFreq
converged: YES YES NO YES
polarizability: 1.46153963e+02 -1.63181792e+01 1.83251790e+02 -2.46040069e-02 -1.83080629e-03 1.69072894e+02
1716.lowfreq: -5.4930 0.0008 0.0013 0.0028 7.3436 9.7781 11.4765 21.3482 44.5324
frequency: 9.3929 19.8053 44.4839 59.3723 65.3493 134.8833 160.6644 180.5370 195.4388 219.5518 235.4760 305.7798 315.5499 317.5752 346.1933 362.7139 379.4392 420.4452 427.5323 436.1759 463.6189 487.5960 489.3961 532.4697 542.6560 559.9261 576.8488 617.2853 625.4567 627.2772 627.8528 673.6676 718.1174 730.1004 764.8858 782.1592 826.5041 878.1133 895.0269 906.2186 917.6101 969.9382 997.9039 1005.2020 1011.1576 1017.7020 1025.6694 1051.7386 1055.0675 1069.9109 1105.3487 1109.7698 1144.3966 1167.9949 1177.6821 1184.2846 1190.7556 1200.9417 1240.7446 1276.1420 1308.6200 1322.9026 1323.2546 1359.8285 1377.1788 1411.8031 1430.6968 1489.1948 1518.5765 1674.0683 1675.1334 3075.2158 3078.8270 3145.6053 3145.8585 3195.9159 3214.0435 3221.9276 3228.5826 3234.0973 3238.2510
redmass: 8.0871 7.2474 4.5828 5.8145 6.6426 3.6209 5.4189 6.7336 7.9875 17.2698 4.1572 3.8495 7.0844 7.1676 14.3748 5.9400 7.8031 2.8745 7.1536 8.8394 18.6937 5.8327 3.6820 6.1791 13.1715 14.7564 5.2452 9.6585 18.4377 6.4180 6.7114 16.1896 2.1367 4.7770 1.3288 1.7017 5.4235 1.2429 8.2313 14.7022 23.6157 1.3507 1.4432 2.3151 2.2602 6.0038 1.3776 1.5408 1.8984 1.5957 1.4227 3.4651 1.2777 3.5224 1.1055 2.1558 1.2066 2.9237 1.5859 2.0632 1.7411 1.8060 1.3682 16.5271 6.8486 1.0816 1.1519 2.3932 2.2938 6.4787 6.1133 1.0606 1.0629 1.1081 1.1040 1.0896 1.0874 1.0905 1.0942 1.0974 1.1013
irintensity: 2.2375 2.1750 0.1052 2.9101 2.8437 3.7758 0.0618 0.0775 0.4548 1.7410 2.6479 5.6505 1.4694 1.9974 0.2346 0.7409 12.9625 0.0876 39.0124 0.0792 0.0247 6.0524 12.0013 12.8314 119.5009 11.4998 66.5063 39.0235 1.3614 0.0264 137.2912 18.5267 38.6034 70.6199 0.0321 13.6103 114.9992 0.0235 294.3438 503.5100 440.4616 2.1820 1.0710 12.0618 37.1053 4.8212 0.1701 2.3460 2.7905 0.0408 15.3607 39.9183 15.7994 183.2668 0.1861 0.6784 0.5563 156.3402 6.0519 1.3550 2.5738 1.6219 11.7551 243.2512 10.3345 34.5088 1.4813 28.0713 3.1175 0.0015 7.4611 0.4591 0.5877 0.4409 0.8824 1.7764 0.4170 6.4088 0.6976 0.5360 11.0029
temp: 298.150 k
press: 1.00000 atm
elementType: 6 6 6 6 1 1 1 1 16 8 8 6 6 6 6 1 6 1 6 1 1 1 16 9 9 9 9 9 1
symmnumber: 1
zpe: 523671.7 jmol-1
zpe.correction: 0.199456 hartree
zpe.thermalcorrener: 0.216590 hartree
zpe.thermalcorrenthalpy: 0.217534 hartree
zpe.thermalcorrgfe: 0.150841 hartree
zpe.sumelectzpe: -1831.326758 hartree
zpe.sumelectthermal: -1831.309624 hartree
zpe.sumelectthermalent: -1831.308680 hartree
zpe.sumelectthermalfe: -1831.375373 hartree
dipole: 1.1301 2.9364 0.0009
dipole: 3.1464
quadrupole: -139.3832 -119.1063 -117.8941
quadrupole: -26.4045 -0.0047 -0.0024
quadrupole: -13.9220 6.3549 7.5671 -26.4045 -0.0047 -0.0024
hfenergy: -1831.5262139 hartree
pointgroup: C01 [X(C10H10F5O2S2)]
dipole: 0.9763026 -0.7428494 -0.1653388 debye
polarizability: 141.6589244|-8.8418158|187.164719|-0.3051535|3.403326|169.6550036 unknown
InChI: InChI=1S/C10H10F5O2S2/c11-19(12,13,14,15)10-6-9(7-10)18(16,17)8-4-2-1-3-5-8/h1-5,10H,6-7H2
charge 0 multiplicity 2
29 atoms
C  0.13557731 -0.02320917 -1.07808888
C  -0.79688015 -0.45443971 0.00862318
C  0.22673241 -0.38592743 1.09669225
C  1.14439582 0.29333229 0.0519712
H  0.43879313 -0.84650519 -1.74475877
H  -0.17081184 0.8315889 -1.69867904
H  0.5719784 -1.37664313 1.43359
H  -0.01645726 0.217428 1.98354265
S  -2.28050289 -1.36943143 -0.08179034
O  -2.89885558 -1.33205032 1.24071172
O  -3.00420098 -0.91359994 -1.2655373
C  -1.69090637 -3.02392365 -0.3828171
C  -1.39319957 -3.84599471 0.70507166
C  -1.49508615 -3.44489659 -1.69900563
C  -0.87738307 -5.1170143 0.46326337
H  -1.57681499 -3.49395013 1.72173716
C  -0.97862882 -4.71847759 -1.92549762
H  -1.75692467 -2.78490656 -2.52792327
C  -0.66824914 -5.54922716 -0.8474848
H  -0.64229067 -5.77495183 1.30185342
H  -0.82243694 -5.06583876 -2.94839951
H  -0.262944 -6.54630654 -1.03101462
S  2.8356308 -0.38057165 -0.13127963
F  2.268268 -1.8799131 -0.35742767
F  2.96525444 -0.65910205 1.4531856
F  3.5229887 1.0630034 0.08052491
F  2.83199707 -0.12924187 -1.72555843
F  4.31317476 -0.99055465 -0.29489131
H  1.28920049 1.36403611 0.22446985
