program: Gaussian 16
title: title
version: ES64L-G16RevC.01
method: RM062X
basis: 6-31G(d)
operation: Freq
keyword: #N
keyword: Geom=AllCheck
keyword: Guess=TCheck
keyword: SCRF=Check
keyword: GenChk
keyword: RM062X/6-31G(d)
keyword: Freq
converged: YES YES YES YES
title: Mulliken charges:
elementType: C O Si O C C C C C O C C C H H H H H H H H H H C H H H C H H H C H H H N C C O C H C N C C C H C H C C H H C H H H C H H H C H H H H
charge: 0.383176 -0.634272 0.932242 -0.667164 -0.148726 -0.743661 -0.758906 0.200974 0.265186 -0.481748 -0.153270 0.014904 -0.231317 0.194256 0.189305 0.216093 0.184417 0.172404 0.173024 0.217784 0.161411 0.215177 0.180286 -0.480945 0.157146 0.150103 0.144670 -0.486827 0.156666 0.158907 0.147272 -0.484062 0.157710 0.169693 0.140408 -0.447455 -0.017626 0.649059 -0.531792 0.125693 0.244538 -0.267249 -0.492538 -0.196307 -0.177639 -0.193677 0.189060 -0.174033 0.195060 0.268012 0.102102 0.191871 0.186889 -0.363555 0.221595 0.217942 0.211763 -0.490376 0.158294 0.195861 0.164777 -0.474307 0.183420 0.192342 0.149786 0.166172
chargesum: -0.00000
title: Mulliken charges with hydrogens summed into heavy atoms:
elementType: C O Si O C C C C C O C C C C C C N C C O C C N C C C C C C C C C
charge: 0.383176 -0.634272 0.932242 -0.667164 -0.148726 -0.180450 -0.202032 0.200974 0.265186 -0.481748 0.247240 0.209160 -0.042012 -0.029026 -0.023982 -0.016251 -0.447455 0.148546 0.649059 -0.531792 0.370232 -0.267249 -0.492538 -0.004436 0.009250 -0.004617 0.021028 0.268012 0.102102 0.287746 0.028556 0.051241
chargesum: 0.00000
1716.lowfreq: -165.9998 -8.4792 -0.0003 0.0011 0.0014 4.1211 5.7131 23.2264 29.1250
frequency: -165.9958 23.1215 28.5007 33.0048 48.3785 53.8862 60.9682 73.8853 78.0411 83.5094 99.7887 115.1180 117.7471 137.5447 142.2670 165.5658 170.4262 179.9102 185.9756 192.4267 200.7431 209.4170 216.8987 226.8081 229.3696 239.6581 240.3423 245.5129 255.4255 261.9410 264.5749 285.1392 287.9542 297.6387 302.6018 304.7445 318.0230 322.5360 335.2502 356.1603 381.7492 389.4873 395.7705 401.1250 426.9811 438.3746 461.9409 475.8380 492.2599 503.5013 525.0410 545.0057 550.6054 565.3244 578.4958 579.4339 595.7357 607.7440 654.3551 685.2775 703.8750 710.7965 724.3042 733.8605 739.0720 762.3389 764.9187 776.1769 783.0184 792.7312 797.3648 807.3886 821.8725 846.0472 853.3328 858.7165 871.1283 889.2837 896.0909 900.9637 920.2273 943.1728 944.0922 967.1459 972.5359 972.7547 972.8795 973.7131 991.2057 1014.3025 1029.9124 1038.7860 1041.7657 1057.6129 1062.2914 1087.9569 1104.8403 1128.7259 1155.0277 1160.3042 1165.6894 1176.9283 1182.7184 1189.4684 1201.3399 1208.8498 1239.8503 1242.0801 1243.6637 1251.0366 1255.4595 1273.4824 1287.9739 1305.4841 1308.3837 1309.2514 1314.5248 1318.0105 1343.8194 1365.9735 1370.8135 1378.2337 1399.6657 1415.1002 1416.6282 1421.0527 1425.1163 1436.4548 1441.4222 1447.3617 1463.7723 1478.0027 1481.4140 1488.2327 1498.7377 1499.5562 1503.6470 1504.3399 1505.5993 1506.5706 1511.5815 1513.2518 1514.2854 1518.2418 1519.3203 1521.6842 1524.3212 1530.2041 1531.4127 1531.7382 1539.0093 1540.8015 1579.2046 1626.6285 1676.5242 1694.6142 1699.3535 1845.1163 3045.4711 3047.6431 3051.2587 3069.2793 3077.8943 3085.2256 3088.8225 3092.0186 3092.5128 3095.2669 3110.7493 3112.1296 3117.8700 3134.2177 3135.6630 3142.5651 3143.9358 3150.6032 3152.1774 3162.3178 3168.4979 3174.1367 3180.7273 3195.0282 3195.5031 3197.8032 3215.7258 3233.8257 3239.9343 3242.5603 3249.5339 3256.1873 3287.2182 3294.1405
redmass: 6.7721 3.7003 4.3332 3.7358 3.0903 3.6961 2.9834 3.6360 4.6973 3.7000 3.8040 5.3032 1.1498 3.6926 4.4593 3.2351 1.3474 2.4992 2.3829 2.5239 2.7442 1.7104 2.4471 1.5441 1.5429 2.2662 3.1017 1.5355 2.6951 2.8458 1.2682 1.8452 1.7112 1.8421 4.1145 1.7523 2.2520 3.0196 3.9091 5.1074 3.6824 2.6693 2.9551 3.6990 3.1503 3.4470 4.3672 5.2834 3.6604 4.6143 4.3189 5.2800 4.6279 4.5371 4.8041 3.4057 4.0825 6.1806 3.9297 4.1444 1.7620 3.7387 1.4207 5.8726 5.0207 2.0830 1.8370 2.5308 1.8878 4.2178 3.5987 2.6706 2.4198 2.1242 2.3904 2.5965 1.7856 1.5111 3.3835 1.9190 1.3766 2.6024 1.1314 1.2286 1.6076 1.5118 1.3631 1.5739 2.3074 1.2890 3.4357 1.4329 1.4086 4.4782 1.9967 1.9397 1.9756 1.9704 1.6002 1.5179 1.6666 2.0056 1.4501 1.6456 1.9858 1.5821 2.7060 1.7168 2.6696 2.4875 2.3939 2.5260 2.8469 1.3381 1.3376 2.1072 2.3515 2.5679 2.5343 1.5517 3.1036 6.3130 2.2180 2.4656 1.3141 1.3239 1.3407 3.0160 1.3132 1.2276 1.3973 1.0678 1.6005 1.1591 1.1364 1.1381 1.5431 1.2779 1.7563 1.1995 1.0534 1.0503 1.0478 1.0651 1.2784 1.1059 1.2469 1.0536 2.1500 1.0610 1.0537 1.0730 4.0210 6.1376 6.8751 8.1464 7.4055 11.7182 1.0383 1.0395 1.0412 1.0367 1.0379 1.0665 1.0716 1.0434 1.0388 1.0385 1.0989 1.0978 1.0949 1.1022 1.1013 1.0994 1.1064 1.1006 1.1007 1.1027 1.1013 1.1006 1.0989 1.0993 1.1015 1.1027 1.1065 1.0868 1.0907 1.0899 1.0946 1.0981 1.0961 1.0968
irintensity: 405.7379 1.0040 0.1255 0.2162 0.2572 3.0106 0.0018 1.1628 1.5866 3.3758 2.1401 17.3458 0.4928 31.1106 2.4225 5.3734 1.0456 4.8425 20.5506 3.1634 5.5448 1.1495 52.9205 1.4289 6.4971 35.3590 37.3148 4.2075 55.1159 16.2177 12.9617 22.0168 4.0780 19.7229 15.0760 1.9131 30.9999 15.6697 97.3488 24.5862 4.5867 4.6993 10.2288 1.5294 17.8385 137.5825 11.6061 8.9332 79.1956 185.7767 26.5624 45.8507 7.0261 28.8464 3.2365 8.3933 81.6744 17.4829 20.2190 125.5338 1.5370 17.2916 77.5166 3.0083 7.1672 68.3678 60.5037 15.0537 49.0924 56.5544 1.3273 131.7516 9.8986 90.0951 6.8790 313.8767 117.9138 20.0291 207.4719 49.0051 45.5136 19.5182 2.6456 0.1054 1.5493 2.0570 7.5860 4.2633 70.1870 0.1596 73.4957 13.2518 9.4976 105.6027 12.5525 51.6363 46.5974 89.7177 53.4684 24.1684 61.8894 6.4726 14.6189 30.1804 16.8794 26.9079 0.0512 39.6292 1.5183 16.3696 1.1558 32.6681 86.2717 41.0571 71.8343 128.3574 262.7502 74.4554 287.6166 72.1847 335.5883 30.2523 434.8938 247.2712 41.1297 45.2162 24.5692 5.1469 67.4491 4.1332 66.8093 9.1138 26.2433 78.1362 25.4389 27.5528 43.3949 16.0580 61.7856 93.1867 1.4208 0.5831 3.7094 16.1129 46.6770 10.7949 64.7872 5.8503 39.5926 9.8563 20.3414 16.9163 658.0238 137.8265 3.1430 455.7849 12.6576 471.5489 37.5848 33.1417 95.9451 7.4860 15.4502 7.1832 37.3058 29.0337 29.2881 37.2328 9.5400 74.8999 53.8867 30.6492 48.2353 16.2769 4.2292 29.3837 15.3053 31.7710 0.7823 30.2756 4.0477 0.6710 9.7250 7.3153 1.2265 0.4599 6.0587 3.4321 7.6831 12.6165 0.4516 12.7902
temp: 298.150 k
press: 1.00000 atm
elementType: 6 8 14 8 6 6 6 6 6 8 6 6 6 1 1 1 1 1 1 1 1 1 1 6 1 1 1 6 1 1 1 6 1 1 1 7 6 6 8 6 1 6 7 6 6 6 1 6 1 6 6 1 1 6 1 1 1 6 1 1 1 6 1 1 1 1
symmnumber: 1
zpe: 1460274.5 jmol-1
zpe.correction: 0.556189 hartree
zpe.thermalcorrener: 0.589347 hartree
zpe.thermalcorrenthalpy: 0.590291 hartree
zpe.thermalcorrgfe: 0.493219 hartree
zpe.sumelectzpe: -1671.887349 hartree
zpe.sumelectthermal: -1671.854191 hartree
zpe.sumelectthermalent: -1671.853247 hartree
zpe.sumelectthermalfe: -1671.950319 hartree
dipole: 6.7173 -6.7204 -0.4578
dipole: 9.5130
quadrupole: -188.8695 -171.6814 -205.2808
quadrupole: -7.0100 8.3031 12.4872
quadrupole: -0.2589 16.9292 -16.6703 -7.0100 8.3031 12.4872
hfenergy: -1672.4435379 hartree
pointgroup: C01 [X(C25H34N2O4Si1)]
dipole: 2.6478869 -2.6381661 -0.190922 debye
polarizability: 489.3085431|-32.4330487|386.8306615|-26.9157149|18.5648071|282.2635267 unknown
InChI: InChI=1S/C25H34N2O4Si/c1-17(2)27-16-25(21(28)20(13-14-30-25)31-32(7,8)23(3,4)5)24(22(27)29)15-26(6)19-12-10-9-11-18(19)24/h9-15,17H,16H2,1-8H3
charge 0 multiplicity 1
66 atoms
C  -0.53478017 0.53372737 1.08645164
O  -0.90298901 1.66752637 0.67829533
Si -3.50617011 0.31572545 -0.12141605
O  -2.69826859 -0.54609 1.09194608
C  -5.05938411 -0.75200959 -0.37797244
C  -4.0211268 2.03163424 0.42046369
C  -2.48023505 0.33255012 -1.69322757
C  0.94142807 0.28099755 1.31048381
C  -1.34669282 -0.58429018 1.28972261
O  1.27845454 -0.70604094 2.19396382
C  1.69776259 1.57996271 1.54557853
C  0.54980833 -1.85202231 2.0836012
C  -0.74757976 -1.80845834 1.66925533
H  1.05370755 -2.7135761 2.50144348
H  -1.33929681 -2.71899728 1.67168012
H  1.06016188 2.27100084 2.10604229
H  2.62545056 1.39381384 2.09925564
H  -4.74929505 2.00110244 1.23856401
H  -4.47501048 2.57946897 -0.41393392
H  -3.13819263 2.5804086 0.75511005
H  -2.17130118 -0.67903571 -1.98274562
H  -1.58874334 0.95423806 -1.56240867
H  -3.0582376 0.74382196 -2.52992467
C  -4.67470614 -2.08712448 -1.02753937
H  -3.9208709 -2.61968661 -0.43434694
H  -4.27316746 -1.94595449 -2.03822583
H  -5.55294132 -2.74323962 -1.11283897
C  -6.05392439 -0.01716405 -1.28620297
H  -5.61473297 0.23398097 -2.26019708
H  -6.40827541 0.91413063 -0.82892567
H  -6.93614357 -0.64446483 -1.4788532
C  -5.72626685 -1.0325421 0.97497597
H  -6.02536464 -0.10722432 1.4820217
H  -5.05463104 -1.57836421 1.64589378
H  -6.63394492 -1.63812206 0.83738171
N  1.94596517 2.12266595 0.21549209
C  2.06235806 3.57629826 0.02645294
C  1.62731935 1.27786237 -0.79936109
O  1.45791877 1.55342709 -1.96922085
C  0.97318133 -1.27162575 -0.81325421
H  -0.08147557 -1.32537621 -1.05376416
C  1.67345615 -0.15756842 -0.23067277
N  1.78412423 -2.29334225 -1.06844841
C  4.26600369 -0.10929758 0.30055614
C  5.42141328 -0.88550239 0.26706535
C  5.3983866 -2.20435012 -0.20350894
H  6.31432582 -2.78609299 -0.21197101
C  4.22132054 -2.7784048 -0.67182923
H  4.19804519 -3.79567566 -1.04895834
C  3.08223063 -1.98315438 -0.63950705
C  3.07068802 -0.67432937 -0.13797423
H  4.29950753 0.91678773 0.65337778
H  6.358791 -0.46038764 0.61074361
C  1.34647639 -3.62815692 -1.42570583
H  0.34780182 -3.56846336 -1.85869971
H  2.03390233 -4.0553126 -2.15779208
H  1.320779 -4.25650727 -0.52833059
C  3.13391587 3.91001661 -1.0081684
H  4.0857245 3.43220073 -0.75421423
H  2.82960235 3.57630747 -2.00212719
H  3.28969019 4.99291572 -1.03579218
C  0.7109511 4.20347976 -0.30945187
H  0.35724963 3.83073433 -1.27463198
H  -0.03522858 3.94320264 0.44390086
H  0.81108108 5.29252674 -0.36629595
H  2.40006114 3.9551624 0.99826174
