program: Gaussian 16
title: Title Card Required
version: ES64L-G16RevC.01
method: RM062X
basis: 6-31G(d)
operation: Freq
keyword: #N
keyword: Geom=AllCheck
keyword: Guess=TCheck
keyword: SCRF=Check
keyword: GenChk
keyword: RM062X/6-31G(d)
keyword: Freq
converged: YES YES YES YES
title: Mulliken charges:
elementType: C O Si O C C C C C O C C C H H H H H H H H H H C H H H C H H H C H H H N C C O C H C N C C C H C H C C H H C H H H C H H H C H H H C H H H
charge: 0.382857 -0.634855 0.932053 -0.667043 -0.148761 -0.744162 -0.759671 0.199599 0.267535 -0.480885 -0.152630 0.016444 -0.232823 0.195033 0.189732 0.217043 0.183512 0.172821 0.172768 0.218627 0.161454 0.216502 0.180048 -0.480980 0.157475 0.150176 0.144606 -0.486815 0.156683 0.158860 0.147255 -0.484008 0.157482 0.169619 0.140449 -0.460027 0.139489 0.656877 -0.530681 0.125656 0.243279 -0.265957 -0.495138 -0.192542 -0.178997 -0.194083 0.188349 -0.174124 0.194416 0.267894 0.100525 0.187282 0.186120 -0.362645 0.221250 0.216806 0.211047 -0.485268 0.153067 0.202049 0.157944 -0.490894 0.161320 0.175000 0.171678 -0.453281 0.185498 0.176155 0.145934
chargesum: -0.00000
title: Mulliken charges with hydrogens summed into heavy atoms:
elementType: C O Si O C C C C C O C C C C C C N C C O C C N C C C C C C C C C C
charge: 0.382857 -0.634855 0.932053 -0.667043 -0.148761 -0.179946 -0.201666 0.199599 0.267535 -0.480885 0.247925 0.211477 -0.043091 -0.028724 -0.024017 -0.016459 -0.460027 0.139489 0.656877 -0.530681 0.368935 -0.265957 -0.495138 -0.005260 0.007123 -0.005734 0.020291 0.267894 0.100525 0.286459 0.027792 0.017104 0.054306
1716.lowfreq: -206.3164 -7.6312 0.0008 0.0013 0.0016 1.8451 6.5317 24.0470 33.7440
frequency: -206.3158 23.9376 33.6791 35.4567 44.5730 49.2083 54.6667 66.8675 76.4392 79.8991 98.6993 110.1306 115.5419 118.0313 137.6897 146.9414 164.8037 173.6587 180.1566 191.8794 197.6264 211.4037 215.1006 224.2405 227.4772 238.8293 242.5766 245.9476 252.6715 262.3830 269.9079 280.7838 287.1901 295.3694 299.7800 305.6913 311.3744 316.8995 324.9517 326.3750 339.6996 359.2714 380.4242 389.9297 391.8293 397.4318 403.1834 438.3846 445.4495 473.1267 479.2112 497.8731 505.6350 522.3212 548.5685 556.8402 566.0039 579.7850 580.3603 595.2318 606.7451 656.2232 685.3394 703.8511 709.4158 722.6072 726.6912 735.3187 761.6890 767.1663 773.5728 781.4293 793.6916 797.3481 803.6277 808.0845 826.1920 852.1951 857.7803 874.0660 879.7547 890.3947 894.3674 912.3351 916.7540 952.1475 956.7641 967.3245 969.6238 973.5371 974.2956 975.8271 991.8830 1012.8849 1030.9389 1039.8140 1043.2906 1054.1328 1063.4657 1066.4829 1069.1270 1087.3790 1109.0309 1136.6241 1159.2675 1168.4672 1179.6157 1191.6327 1201.6282 1214.4739 1241.3311 1243.7579 1248.1216 1254.9515 1256.0602 1270.8664 1281.1772 1289.5309 1296.2704 1307.9843 1308.7745 1315.5148 1320.5748 1326.1276 1348.5228 1371.9186 1379.0853 1410.4788 1417.2740 1421.1213 1423.0409 1427.3216 1437.2408 1447.6316 1450.3400 1454.6888 1468.2083 1477.7367 1487.1374 1493.7626 1499.4538 1501.0908 1503.3368 1505.0692 1506.5394 1509.6343 1511.9890 1513.7124 1514.4007 1515.2591 1516.9924 1520.0746 1522.3596 1531.2886 1531.4314 1531.7715 1532.6079 1539.1843 1546.7024 1578.9112 1625.2579 1675.1482 1694.2479 1698.9293 1843.3855 3045.9170 3047.3693 3051.1750 3068.2187 3077.5190 3083.0372 3086.9427 3090.3939 3091.1209 3095.3391 3110.6948 3112.3148 3117.4550 3134.2969 3135.7199 3141.6524 3150.2889 3151.9073 3152.0740 3154.6033 3162.2055 3169.5504 3170.0865 3175.5014 3179.1597 3188.7424 3193.1131 3215.9523 3215.9731 3231.8708 3238.8740 3239.1237 3246.2011 3253.9397 3286.6358 3293.0278
redmass: 7.3302 3.5284 4.1574 3.6816 2.7988 3.1889 4.1397 2.8956 4.8328 3.7304 3.3967 2.9113 1.3377 1.4565 5.3475 2.8904 2.8482 2.0779 2.6475 2.6157 2.8716 1.5671 2.9501 2.2201 1.4199 2.9065 1.8032 2.5087 2.6901 2.4527 1.1836 2.1572 1.3415 1.6731 1.6206 1.8098 2.7032 2.2897 2.9492 2.8245 3.8612 4.2925 3.2766 2.4370 3.6810 2.4675 3.1888 3.3969 3.1958 5.4016 4.0022 3.3900 3.8331 5.0908 5.8141 3.9011 4.4013 5.6850 3.2250 4.0491 5.8722 3.8941 4.2361 1.8805 3.1894 2.9165 1.8650 6.0020 3.8638 1.2814 2.4847 2.0075 4.4621 3.4626 3.8077 2.6271 2.4173 2.0880 2.2979 1.6856 1.8089 1.6308 2.8980 1.6137 2.5071 1.5780 1.5782 1.2308 1.3574 1.6287 1.5567 1.2131 2.4046 1.2885 3.6228 1.4418 1.3924 2.1238 2.0023 1.5356 2.1148 1.8690 1.9665 1.9387 1.3782 1.6498 1.4584 1.5135 2.0522 1.8700 2.7228 2.7121 1.9184 2.6651 2.3931 2.4616 2.8100 2.4131 3.0932 1.2959 1.3460 2.0980 2.4306 3.1257 2.6883 4.2385 6.5542 4.2546 1.2639 1.2820 1.3472 1.3197 2.9484 1.2278 1.7674 1.4620 1.4155 1.0520 1.1025 1.0624 1.0904 1.5212 1.1615 1.4315 1.3530 1.3073 1.0525 1.0504 1.1194 1.0650 1.2283 1.0709 1.1421 2.1854 1.1041 1.0561 1.0749 1.0538 1.0605 4.0361 6.0806 6.8894 8.1391 7.3543 12.1207 1.0381 1.0396 1.0412 1.0370 1.0377 1.0390 1.0391 1.0395 1.0418 1.0568 1.0992 1.0974 1.0951 1.1020 1.1013 1.0997 1.1004 1.1057 1.1006 1.1026 1.1007 1.1003 1.1004 1.1017 1.0986 1.1033 1.0997 1.0982 1.1062 1.0867 1.0908 1.0900 1.0946 1.0982 1.0962 1.0969
irintensity: 555.6793 0.8793 0.1501 0.2668 0.2526 0.1737 1.8803 0.4479 2.3024 2.7006 1.1007 19.6256 2.8127 2.2235 11.6928 10.9917 2.6295 4.6435 8.8589 17.7699 0.3810 0.2975 49.5825 4.1488 0.7438 93.9900 7.8506 5.0338 38.0974 3.7503 4.7719 13.9649 2.9928 3.2213 10.4215 3.7974 12.9182 18.9672 28.2693 18.8375 70.7664 21.2755 2.8849 2.3002 6.5820 9.6293 4.2820 137.6424 1.6980 8.1458 6.1774 106.0202 192.7073 10.3490 9.5729 13.0534 22.9966 4.4339 8.7724 67.3878 17.3251 13.5019 99.1267 3.4011 18.5415 22.7476 51.7083 2.9800 113.3589 4.4309 20.8054 54.3525 46.9522 0.5366 51.9781 106.0800 9.3821 147.5145 237.5312 139.5383 10.1934 3.5363 175.1809 92.8966 61.7274 2.5029 0.4678 0.0930 5.9817 3.0819 3.3007 0.6451 65.6445 0.1198 68.7554 14.0190 6.9144 52.8321 13.3363 20.5007 54.8102 43.8343 49.0665 87.2128 42.4571 65.4634 4.2110 43.2831 52.5180 9.4847 0.0783 2.3897 61.3757 31.9601 1.3687 40.5821 34.1119 22.7453 234.2741 67.3107 47.6642 259.2910 58.9143 38.8260 354.6555 357.4954 46.7254 596.3373 17.0374 25.6185 8.6970 36.6145 3.6592 3.1679 43.2835 101.6850 58.7841 4.6215 79.5935 7.1745 10.9985 58.5129 2.6107 17.6736 36.1665 153.0256 1.0633 1.5440 25.6826 3.5787 32.2093 11.9412 28.6508 25.4555 7.5509 8.9281 6.3266 19.9919 13.6246 640.0429 133.6235 3.6059 445.0273 13.0308 467.4113 37.8925 33.0517 95.7535 7.6630 16.2761 7.5610 23.7898 31.0449 24.9399 37.4388 10.5699 72.5037 56.4923 31.6321 50.7382 14.0183 31.4716 1.6640 13.1941 11.3174 42.6601 10.9170 12.5596 42.4457 4.2346 9.0278 0.8745 4.4346 1.4654 0.3070 5.4271 2.0143 7.1411 13.3224 0.3304 11.5023
temp: 298.150 k
press: 1.00000 atm
elementType: 6 8 14 8 6 6 6 6 6 8 6 6 6 1 1 1 1 1 1 1 1 1 1 6 1 1 1 6 1 1 1 6 1 1 1 7 6 6 8 6 1 6 7 6 6 6 1 6 1 6 6 1 1 6 1 1 1 6 1 1 1 6 1 1 1 6 1 1 1
symmnumber: 1
zpe: 1533726.4 jmol-1
zpe.correction: 0.584166 hartree
zpe.thermalcorrener: 0.618664 hartree
zpe.thermalcorrenthalpy: 0.619608 hartree
zpe.thermalcorrgfe: 0.520000 hartree
zpe.sumelectzpe: -1711.154702 hartree
zpe.sumelectthermal: -1711.120203 hartree
zpe.sumelectthermalent: -1711.119259 hartree
zpe.sumelectthermalfe: -1711.218867 hartree
dipole: 6.2840 -6.9314 -0.1206
dipole: 9.3567
quadrupole: -197.5371 -173.8790 -212.8682
quadrupole: -4.7882 8.5317 10.2743
quadrupole: -2.7757 20.8825 -18.1068 -4.7882 8.5317 10.2743
hfenergy: -1711.7388671 hartree
pointgroup: C01 [X(C26H36N2O4Si1)]
dipole: 2.5052287 -2.6970074 -0.0346916 debye
polarizability: 496.7801814|-34.6097657|408.5789745|-23.7680535|14.6304284|291.2934442 unknown
InChI: InChI=1S/C26H36N2O4Si/c1-23(2,3)28-17-26(21(29)20(14-15-31-26)32-33(8,9)24(4,5)6)25(22(28)30)16-27(7)19-13-11-10-12-18(19)25/h10-16H,17H2,1-9H3
charge 0 multiplicity 1
69 atoms
C  -0.58571115 0.48540128 1.00509416
O  -0.89461518 1.60802642 0.52259498
Si -3.58269913 0.35901788 -0.15115201
O  -2.80343108 -0.47081356 1.10321006
C  -5.1972177 -0.63343744 -0.31454375
C  -3.98966504 2.13271132 0.28638684
C  -2.58546797 0.21496109 -1.73476857
C  0.87418651 0.17237686 1.23848063
C  -1.45419119 -0.57077134 1.28928563
O  1.17263346 -0.77841309 2.17099744
C  1.69879458 1.44049003 1.39278828
C  0.37992628 -1.88565145 2.14926445
C  -0.91813047 -1.79824186 1.74545434
H  0.84322141 -2.74370067 2.61802585
H  -1.5593527 -2.67159445 1.8169832
H  1.08503689 2.18448173 1.90849692
H  2.60844619 1.24148968 1.97017913
H  -4.68310279 2.19616312 1.13234462
H  -4.45218018 2.64332636 -0.56672841
H  -3.06814531 2.65797543 0.54651823
H  -2.33755317 -0.8296808 -1.95842476
H  -1.65883547 0.79280327 -1.65778622
H  -3.15402507 0.6006859 -2.58989506
C  -4.89621273 -2.02730072 -0.87910615
H  -4.16395883 -2.56101287 -0.26052443
H  -4.50196392 -1.97419635 -1.90106461
H  -5.81022253 -2.63768263 -0.91157773
C  -6.16566186 0.09407714 -1.25606491
H  -5.73041868 0.25507532 -2.25067756
H  -6.46028094 1.0719677 -0.85742042
H  -7.08424788 -0.49426203 -1.39384387
C  -5.85489643 -0.78684699 1.06304943
H  -6.09631446 0.18505977 1.5100737
H  -5.20163276 -1.32168727 1.76041065
H  -6.79535201 -1.35078047 0.97889745
N  1.98795238 1.89525876 0.03252545
C  2.20827553 3.33553917 -0.25108652
C  1.57080471 1.01717412 -0.92435148
O  1.34389079 1.23372988 -2.09614081
C  0.81609652 -1.49721029 -0.79965247
H  -0.24083363 -1.51242433 -1.03581171
C  1.57420675 -0.38879465 -0.29102723
N  1.57298813 -2.57554007 -0.98372131
C  4.16797874 -0.43274652 0.23203792
C  5.28178175 -1.26755291 0.25190299
C  5.18959685 -2.61310433 -0.12660183
H  6.07454552 -3.24035445 -0.09479784
C  3.98319448 -3.15688949 -0.55380149
H  3.90686505 -4.19551217 -0.85896049
C  2.88604213 -2.30372008 -0.57757404
C  2.94342285 -0.96382021 -0.16819879
H  4.25363202 0.61224884 0.5139075
H  6.24079702 -0.86846429 0.56591165
C  1.06753287 -3.90604883 -1.25614646
H  0.08497808 -3.82204782 -1.72050057
H  1.74639123 -4.42201007 -1.93735558
H  0.98443776 -4.46592712 -0.31776511
C  3.1028344 3.48329457 -1.48727444
H  4.03040865 2.91354944 -1.360137
H  2.60237689 3.1382877 -2.39125679
H  3.3646327 4.5389415 -1.61144137
C  2.94946885 3.95292486 0.93975724
H  3.89148832 3.42725853 1.13448643
H  3.1873381 4.9948554 0.70653267
H  2.35064851 3.95076389 1.85476525
C  0.86261798 4.03150038 -0.46586909
H  0.3407111 3.58676238 -1.31687031
H  0.22054224 3.91954415 0.41165064
H  1.02264809 5.09757977 -0.66222454
