program: Gaussian 16
title: Title Card Required
version: ES64L-G16RevC.01
method: UB3LYP
basis: Gen
operation: Freq
keyword: #
keyword: freq
keyword: b3lyp/gen
keyword: empiricaldispersion=gd3bj
keyword: pseudo=read
keyword: scf=xqc
keyword: geom=check
title: # freq b3lyp/gen empiricaldispersion=gd3bj pseudo=read scf=xqc
converged: NO NO NO NO
elementType: N
elementType: C
elementType: H
elementType: Fe
elementType: S
elementType: O
1716.lowfreq: -8.8442 -7.1093 -2.4848 -0.0011 -0.0006 0.0005 15.9662 17.2110 25.2598
redmass: 4.7253 5.2770 5.3484 4.8855 5.3730 4.1347 3.2657 3.8734 3.6503 4.2026 4.0896 4.0884 6.7101 3.5576 4.4897 4.4886 5.2700 2.0727 3.0446 1.5245 5.1117 4.7468 3.2957 4.0503 5.0669 4.5515 2.7884 1.8438 2.2386 1.6194 1.7454 2.9708 2.1219 1.9098 7.5677 2.7961 2.9654 2.3503 4.8222 6.8505 2.2310 4.8539 7.4451 2.2843 4.4131 2.4195 3.8043 3.2120 4.2307 2.4221 5.0558 7.3979 7.2963 2.4499 6.3362 2.1079 2.7813 5.7493 6.0083 4.5750 2.8277 4.0366 3.8197 3.8291 2.3431 2.4873 2.7892 3.8278 2.7017 2.2258 2.2648 2.5907 2.2459 2.0474 4.9352 2.3354 1.6412 2.9168 3.2184 3.2830 4.7621 3.2645 2.6144 2.8540 2.9382 4.6217 2.4084 2.2715 1.9714 2.0010 2.0355 4.0581 4.4274 4.4404 2.4376 1.8211 1.7491 1.7758 1.7685 2.5030 6.7170 6.5628 6.5334 2.9429 2.4622 1.5901 1.8319 1.9519 1.3317 1.4034 1.3993 1.4840 2.1293 2.4705 1.9457 1.3432 1.1889 1.3839 1.3981 1.3729 1.6781 1.6256 1.5200 1.6324 1.4494 1.8664 2.1819 1.2046 1.6666 1.5872 1.7602 2.0583 6.5659 6.4005 7.7524 1.8751 2.7503 6.5115 1.6846 1.7326 2.9115 2.9841 1.7646 1.6215 2.5907 5.1017 1.1799 1.1443 2.1759 1.1478 1.1465 2.3943 1.8859 2.3836 2.1261 1.6022 1.5987 1.8126 1.8179 1.8180 1.3425 1.3291 2.1615 1.9844 1.3765 1.2848 1.7891 1.4460 1.3636 1.4230 3.4194 3.1075 1.3979 1.3201 1.3476 2.7485 1.3563 2.7490 1.3865 1.6817 1.8338 1.3440 1.4382 1.3506 1.3535 1.4495 1.4298 2.3934 1.3945 2.5970 1.3746 1.6067 3.8624 2.0545 1.4490 1.2612 1.2544 1.3987 2.6433 2.7824 2.4847 1.2846 1.0553 1.1291 1.5475 1.0799 1.0655 1.1075 4.0899 1.0755 1.1159 4.7564 3.9700 1.2222 1.0768 1.0828 1.0660 1.0749 1.0930 1.0812 6.1421 5.0430 1.7056 6.4435 6.3366 6.7539 5.6070 6.3553 6.5913 8.0420 4.7511 6.9691 1.0812 1.0673 1.0824 1.0430 1.0570 1.0709 1.0506 1.0574 1.0464 1.0305 1.0607 1.0638 1.0985 1.0833 1.0906 1.0785 1.1027 1.1001 1.1000 1.0995 1.0977 1.0845 1.1017 1.1005 1.0981 1.0975 1.1061 1.0597 1.1063 1.0887 1.0570 1.0864 1.0896 1.0896 1.0897 1.0891 1.1161 1.0891 1.0890 1.0891 1.0912 1.1148 1.1048 1.1051 1.1049 1.1025 1.0656
irintensity: 0.0645 0.0668 0.0920 0.5387 0.2719 0.1113 0.3287 0.6402 1.4368 0.3407 0.0448 0.4479 1.5715 1.8059 1.6171 3.3503 0.2582 1.6350 0.3348 0.2826 6.3953 0.9463 5.1272 9.4392 0.2022 1.5138 0.2625 0.6141 0.1746 0.4307 0.0962 0.7598 0.2170 0.7938 12.3641 3.3727 2.5304 3.5267 3.0948 0.2227 1.8346 0.0133 2.8150 0.9600 6.8680 1.0432 12.3687 0.3693 5.8833 0.1756 2.1501 0.1465 1.6986 1.2398 4.8593 0.5447 6.2272 14.5612 3.8446 0.1049 0.4442 0.2258 1.8287 0.0435 0.3778 3.2314 0.1727 0.7970 3.3407 1.0349 24.6079 4.7630 15.5503 2.1518 19.9310 4.2776 1.0761 0.2149 0.4080 0.8050 0.5290 0.6721 1.3382 1.6034 30.2512 60.3264 29.1478 10.6419 7.7453 5.1972 14.0271 5.0040 18.1118 12.6561 8.8477 28.3632 0.1367 1.9883 1.0911 5.1149 6.4254 8.3739 8.2798 7.4192 21.6978 6.1202 7.2707 7.4997 3.7362 3.2399 0.1901 66.0503 5.8269 1.3672 1.3955 0.7743 27.0678 0.8395 0.6310 0.6609 12.5264 18.1645 5.9638 45.7923 14.1973 2.4425 5.5741 40.0464 2.3541 1.3992 10.0559 1.5374 27.9272 48.3677 87.3344 9.4756 3.7270 0.7197 5.6487 19.6553 1.5310 1.1990 4.2629 0.5930 0.7683 0.4985 60.0168 35.0175 0.4998 31.7734 1.4928 1.2663 2.0435 11.3488 26.2028 3.1049 5.7925 1.6939 2.7058 3.5052 1.1450 4.0277 0.1714 0.0098 0.6992 3.1445 2.6884 2.3401 5.8626 13.1062 12.5316 3.4873 5.6060 5.6588 0.4106 28.1802 34.4795 52.8450 2.9028 34.0754 87.0493 6.4339 2.9623 0.2994 0.4733 28.7270 0.0218 2.8591 5.3929 0.2700 13.2525 17.5426 17.1619 6.9615 2.8595 14.1710 2.9228 6.3853 2.6592 5.7967 3.9024 0.6515 2.3965 32.1664 6.0864 7.2005 5.1402 7.3649 16.6354 13.2930 3.1450 22.7543 22.8297 4.4135 10.5076 7.3308 14.8108 17.5819 0.7226 3.1407 4.9255 2.1005 4.8308 13.7946 27.4638 27.8952 0.4758 2.3987 12.1324 1.0603 15.4707 23.5320 26.6139 52.8726 60.9640 25.4568 10.4228 14.6182 95.7192 14.8538 75.2635 12.3533 37.8640 34.7498 29.4720 36.7212 28.8418 6.6541 49.3175 53.0296 20.9544 83.0193 27.0039 10.9686 25.2799 30.4829 27.5947 14.8105 2.5610 10.0125 11.5028 14.4008 2.8930 10.7784 5.5964 5.7773 4.6999 1.8746 28.6641 1.4640 1.5417 1.7125 2.4610 1.5247 5.5911 9.9138 11.4896 3.4156 23.6956
temp: 298.150 k
press: 1.00000 atm
elementType: 7 7 7 7 6 6 6 6 6 6 6 6 6 6 6 6 6 6 6 6 6 6 6 6 1 1 1 1 1 1 1 1 1 1 1 1 26 16 6 1 1 1 8 6 6 6 6 6 6 1 1 1 1 1 1 1 1 6 1 1 1 6 6 1 1 6 1 1 1 6 1 6 6 1 1 1 1 6 6 1 1 6 6 6 1 1 6 1 1 6 1 1 1 1 1
symmnumber: 1
zpe: 2082785.1 jmol-1
zpe.correction: 0.793291 hartree
zpe.thermalcorrener: 0.838990 hartree
zpe.thermalcorrenthalpy: 0.839935 hartree
zpe.thermalcorrgfe: 0.714620 hartree
zpe.sumelectzpe: -2406.024375 hartree
zpe.sumelectthermal: -2405.978675 hartree
zpe.sumelectthermalent: -2405.977731 hartree
zpe.sumelectthermalfe: -2406.103046 hartree
dipole: -0.4172 -0.6160 1.0897
dipole: 1.3195
quadrupole: -274.0064 -283.6228 -312.3594
quadrupole: -0.4527 -11.8395 8.0503
quadrupole: 15.9898 6.3734 -22.3632 -0.4527 -11.8395 8.0503
hfenergy: -2406.8176655 hartree
pointgroup: C01 [X(C41H47Fe1N4O1S1)]
dipole: -0.1641553 -0.2423446 0.4287237 debye
polarizability: 1046.3854348|-21.279241|661.4160423|32.9852616|23.161319|528.0041782 unknown
InChI: InChI=1S/C20H12N4.C20H31.CH4S.Fe.H2O/c1-2-14-10-16-5-6-18(23-16)12-20-8-7-19(24-20)11-17-4-3-15(22-17)9-13(1)21-14;1-14(2)18-12-10-17(5)19-11-9-15(3)7-6-8-16(4)13-20(18)19;1-2;;/h1-12H;7,13,17-20H,1,4,6,8-12H2,2-3,5H3;2H,1H3;;1H2/q-4;;;+6;/p-2
charge 0 multiplicity 2
95 atoms
N  1.27054869 1.06863031 1.23981132
N  1.33363244 -1.68030297 0.5068993
N  3.89070122 -1.29192566 -0.69231337
N  3.73801202 1.515938 -0.14320295
C  1.37007077 2.4301386 1.42017293
C  0.25673728 2.90104021 2.20873195
C  -0.51344504 1.81134771 2.49825568
C  0.12228339 0.67527101 1.87653164
C  -0.39350294 -0.61416309 1.88212589
C  0.16326733 -1.70114332 1.22669309
C  -0.39449521 -3.03540814 1.23201324
C  0.46110278 -3.82214884 0.52044835
C  1.54882013 -2.97181114 0.09018879
C  2.67475915 -3.42178594 -0.58362616
C  3.7604623 -2.63411519 -0.9449562
C  4.90653835 -3.1132475 -1.68052815
C  5.71657325 -2.03463933 -1.89125249
C  5.06435643 -0.89809766 -1.28557896
C  5.56168689 0.39883078 -1.33069176
C  4.93246475 1.52176791 -0.80978908
C  5.4488774 2.87261843 -0.89625097
C  4.54051336 3.67708642 -0.27585738
C  3.47596273 2.81541139 0.19554759
C  2.37318967 3.24714205 0.91973954
H  0.09679247 3.93336251 2.49017321
H  -1.43490444 1.76637143 3.0633852
H  -1.31443344 -0.77634953 2.42925685
H  -1.31505901 -3.31587678 1.72341082
H  0.38692403 -4.88110579 0.31159471
H  2.71210133 -4.47361093 -0.84755001
H  5.04981677 -4.13708029 -1.99927238
H  6.66075948 -1.9931676 -2.41779223
H  6.50894735 0.54798125 -1.83870802
H  6.3792638 3.14801943 -1.37481358
H  4.57240269 4.74956356 -0.13717876
H  2.29868599 4.30889373 1.13097895
Fe 2.53635326 -0.10354874 0.2010538
S  3.62255985 -0.22542393 2.25143795
C  5.30885151 -0.83895753 1.98233062
H  5.85746733 -0.12015807 1.36498992
H  5.80698813 -0.93270022 2.95005848
H  5.2937765 -1.79896998 1.46260871
O  1.77830925 0.27275294 -1.38216818
C  -5.44038745 -0.19673271 1.5928235
C  -5.32518382 0.13374934 0.08253729
C  -3.98955053 -0.38218495 -0.54389824
C  -3.64139801 -1.87414262 -0.17275441
C  -3.928035 -2.19645604 1.30936722
C  -5.27340846 -1.70235498 1.82683167
H  -4.13618674 -0.37764706 -1.63259794
H  -6.12419952 -0.43381334 -0.41295481
H  -4.61230297 0.31645517 2.10958163
H  -2.55873088 -1.96338212 -0.2773712
H  -3.81808172 -3.27567495 1.46576278
H  -3.1489968 -1.70953044 1.90890822
H  -6.102866 -2.23520829 1.34474287
H  -5.35357762 -1.91812717 2.89989439
C  -6.75780059 0.27858719 2.22367411
H  -6.8366844 -0.08893794 3.25285783
H  -6.84553125 1.36716857 2.25632778
H  -7.61843754 -0.11285852 1.66606608
C  -4.21449935 -2.90019542 -1.14003505
C  -3.39687566 -3.82331432 -1.66862584
H  -3.76329479 -4.58402291 -2.35310381
H  -2.33714198 -3.84669692 -1.42759626
C  -5.67758481 -2.87218184 -1.50928982
H  -6.32379558 -2.96449612 -0.63021506
H  -5.94463155 -1.9290504 -2.00007097
H  -5.92036343 -3.68693042 -2.19698386
C  -2.81391848 0.5211824 -0.29813401
H  -2.89354295 1.270033 0.48428966
C  -1.37121053 -0.34366035 -2.09800869
C  -1.6197819 2.80593801 -2.37879765
H  1.05321512 -0.36358871 -1.49645176
H  -1.89732781 -1.28675859 -2.18589817
H  -1.39311137 3.86496049 -2.21002521
H  -1.14388429 2.52487749 -3.32358265
C  -1.69677047 0.61353444 -1.16373852
C  -0.989885 1.95809738 -1.22092216
H  0.08526592 1.8391535 -1.373641
H  -1.13809194 2.48592851 -0.27501646
C  -3.10126975 2.53722397 -2.45666475
C  -4.02776934 2.96935964 -1.5884118
C  -5.65706922 1.63578033 -0.13610171
H  -5.15604123 2.2211912 0.64347523
H  -6.72539857 1.74057148 0.07259917
C  -5.38793506 2.31133269 -1.5086708
H  -6.16761882 3.07265272 -1.6534279
H  -5.50231499 1.58675802 -2.32323861
C  -3.7425184 4.04645277 -0.56779608
H  -3.49363209 3.62692025 0.41568133
H  -2.90261038 4.67664599 -0.86932787
H  -4.61848016 4.69101389 -0.42586763
H  -3.39519265 1.74334346 -3.14104294
H  -0.58215156 -0.15638444 -2.82012975
