program: Gaussian 16
title: Template file
version: ES64L-G16RevC.01
method: RPBE1PBE
basis: def2SVP
operation: Freq
keyword: #N
keyword: Geom=AllCheck
keyword: Guess=TCheck
keyword: SCRF=Check
keyword: GenChk
keyword: RPBE1PBE/def2SVP
keyword: Freq
converged: YES YES NO YES
title: Mulliken charges:
elementType: Pd C C C C C C H H H H H C C C C C H H H H H N C C H H H O C H H H N H H C C C C H C H C H H H N H H C C C C H C H C H H H I
charge: -0.115620 -0.024107 -0.019313 -0.022609 -0.039005 -0.036851 -0.061349 0.055890 0.040534 0.041306 0.042961 0.033645 0.026447 -0.190941 0.071328 -0.052264 0.020450 0.081166 0.098479 0.092574 0.064901 0.057064 -0.290045 0.140522 -0.045933 0.090526 0.079511 0.055312 -0.348683 -0.025455 0.058695 0.061197 0.062800 -0.157303 0.182093 0.176921 0.035163 -0.039906 -0.041980 -0.040392 0.035323 -0.044378 0.012533 -0.039162 0.038261 0.037052 0.033134 -0.087390 0.176679 0.199404 -0.018076 -0.020277 -0.016543 -0.034309 0.046394 -0.033875 0.046098 -0.015768 0.053861 0.050312 0.047811 -0.584815
chargesum: -0.00000
title: Mulliken charges with hydrogens summed into heavy atoms:
elementType: Pd C C C C C C C C C C C N C C O C N C C C C C C N C C C C C C I
charge: -0.115620 -0.024107 0.036577 0.017925 0.002301 0.006110 -0.027704 0.107614 -0.092462 0.163901 0.012637 0.077514 -0.290045 0.140522 0.179416 -0.348683 0.157237 0.201712 0.035163 -0.004583 -0.029447 -0.002131 -0.007326 -0.006028 0.288693 -0.018076 0.026117 0.029555 0.019552 0.016437 0.032042 -0.584815
chargesum: 0.00000
1716.lowfreq: -358.9507 -10.3722 -3.6032 -0.0003 0.0005 0.0006 5.4693 12.8865 18.7113
frequency: -358.9506 12.6381 18.0975 23.1625 29.1623 32.0695 43.0355 56.8607 62.9367 63.5050 71.4832 73.9981 81.6033 89.2446 90.9953 104.6402 110.3784 128.7783 144.9734 148.0939 150.6312 168.9854 194.6916 205.8536 225.4063 237.3405 274.0702 297.2195 307.1741 323.7919 329.7806 357.1712 381.1318 387.1885 416.9400 419.8308 424.7492 426.4744 442.7349 464.6346 522.6043 528.5818 530.6090 536.0830 541.8450 543.3610 563.5317 587.3603 600.5728 616.4854 626.9307 629.0859 631.9337 633.1297 659.0800 701.1724 718.0395 721.3088 725.6616 728.4602 775.2894 776.7014 782.7186 793.9975 830.2263 836.6318 848.1074 852.1120 858.4021 865.6363 871.3736 874.5720 914.4598 926.8072 935.7697 943.2346 960.2575 975.1542 1000.3021 1002.0537 1004.8433 1006.6102 1014.2867 1015.0970 1016.8924 1021.6036 1028.2467 1031.6181 1039.9199 1042.2291 1057.3314 1057.6378 1059.6782 1061.7407 1063.2735 1082.7905 1083.6986 1095.4816 1109.0202 1124.1470 1136.9434 1138.0816 1143.9797 1159.3932 1159.6183 1164.7373 1166.6030 1181.5011 1188.4506 1195.0462 1216.0051 1231.7317 1284.4007 1296.7202 1302.8287 1306.0514 1319.8073 1335.1828 1343.5768 1346.7085 1350.2129 1351.1482 1371.4207 1389.2604 1398.9451 1402.0373 1406.9544 1411.3536 1419.0474 1439.0327 1440.9788 1460.0806 1465.1415 1475.0868 1487.1121 1506.3220 1509.1235 1526.8451 1536.1722 1540.7655 1542.7412 1617.1884 1619.1777 1661.6916 1670.9675 1680.1848 1683.5752 1689.4789 1690.5042 1763.5277 3051.6590 3056.6023 3083.3620 3128.5311 3146.5439 3156.1046 3161.9826 3167.2589 3184.8807 3191.9212 3201.6591 3201.9034 3204.6894 3207.1260 3208.1969 3210.0456 3210.5748 3216.7187 3218.7978 3221.0611 3223.6808 3228.9774 3229.5781 3231.4035 3238.5864 3241.0560 3528.1031 3531.0990 3614.2281 3621.8723
redmass: 7.4452 5.1427 5.2400 7.6859 6.7725 5.7677 5.7546 9.5025 8.4192 4.9347 6.0589 4.1751 4.5507 4.8944 5.0305 5.4349 5.9032 3.5807 5.4183 7.2526 5.8522 5.7293 4.2428 1.0774 4.4278 4.1229 3.4091 3.9345 1.8278 1.6421 3.7635 4.5301 2.1835 2.3630 3.8597 2.9185 2.9311 2.9794 4.1379 4.5270 2.9536 3.6967 2.7575 3.2063 4.1733 3.8243 1.5146 4.1702 4.5958 4.1720 3.4462 5.8606 5.7793 4.6899 4.8934 1.6598 1.7849 1.7018 1.9001 2.8529 1.7067 1.9130 1.8400 1.2417 3.3836 3.0264 3.1035 1.2883 1.2957 1.7014 1.4585 1.5086 2.1209 1.5747 1.3871 1.4142 1.6216 1.8516 1.3671 1.9324 1.3652 1.3996 5.2142 4.6018 5.1972 1.3044 1.3141 1.3281 1.9045 1.9969 2.0054 1.6471 1.7468 2.0399 1.8541 1.8165 1.5181 1.4506 1.5309 1.9776 1.1973 1.1989 1.1608 1.2882 1.0970 1.0639 1.0680 1.0994 1.1008 1.1102 1.1186 2.0341 2.4597 1.8173 2.9862 2.9072 1.2778 1.6657 1.4411 1.2850 1.3749 1.2802 1.3163 1.7702 1.7172 5.5453 7.0561 5.6822 2.0936 1.2103 1.2052 1.1701 2.3666 1.0863 2.4565 2.5887 2.5200 4.1179 2.5380 2.6447 2.7766 1.1628 1.1322 6.3367 6.3446 6.3723 6.3851 6.4498 6.4007 10.7674 1.0405 1.0380 1.0837 1.0870 1.1020 1.1034 1.0920 1.1030 1.0910 1.0893 1.1038 1.0873 1.0931 1.0892 1.0903 1.0880 1.0910 1.0942 1.0934 1.0917 1.0950 1.0963 1.0984 1.1004 1.1008 1.0955 1.0526 1.0512 1.0980 1.0977
irintensity: 1734.5902 0.4161 4.1582 0.2149 0.2046 1.0199 1.5246 1.5152 1.3718 0.6956 1.6343 0.2353 0.7750 3.3999 5.7739 9.4208 4.1919 8.2593 3.3403 8.3108 10.1815 6.5144 25.4800 1.6216 12.9962 3.4243 19.3018 23.0951 1.4579 1.2243 3.5773 127.8095 9.6771 36.6557 2.5400 0.3358 0.0868 0.6110 6.1180 22.4279 6.1430 6.0762 17.8468 48.9454 17.0496 32.8951 31.6546 31.9659 40.1484 70.7544 2.1440 0.7456 6.3439 21.4654 35.1579 40.6655 60.2788 69.0689 36.9648 16.0171 34.3624 62.1967 27.9581 145.3888 173.8892 9.1518 5.6730 0.6266 4.9412 80.2538 110.1271 233.5239 71.0250 88.3497 2.0360 11.6717 43.2637 38.9187 0.1115 16.9520 0.2445 4.9503 2.2823 5.4377 0.7089 0.5525 1.5515 1.2509 17.9704 24.5484 16.5251 133.0987 167.8985 13.6509 53.7982 42.2570 8.7014 43.8374 14.5860 21.5138 43.5281 26.4443 13.9224 12.2612 4.0803 0.0523 0.0761 4.3561 2.7611 0.3422 124.0221 6.5329 44.9105 15.0233 130.7395 9.4710 20.0126 31.8196 53.5080 2.0336 16.3266 3.6658 6.9204 55.4630 10.8893 5.7486 6.8571 50.6195 334.2835 47.4016 65.0818 96.4781 179.9114 15.0431 27.7376 5.1836 14.7023 656.5069 30.2458 125.0921 15.6960 58.6723 73.7452 0.7764 8.5952 5.8032 6.8023 46.2178 184.6356 784.6711 35.4251 27.4756 3.9708 5.2450 10.9411 27.3036 8.2074 12.5636 2.5795 9.9507 5.6478 7.3150 6.9114 2.3369 5.9192 0.1879 1.3300 12.5137 12.9803 1.3982 6.8059 6.8052 14.0226 11.0699 8.1767 2.9737 117.9852 80.9623 107.0483 114.7356
temp: 298.150 k
press: 1.00000 atm
elementType: 46 6 6 6 6 6 6 1 1 1 1 1 6 6 6 6 6 1 1 1 1 1 7 6 6 1 1 1 8 6 1 1 1 7 1 1 6 6 6 6 1 6 1 6 1 1 1 7 1 1 6 6 6 6 1 6 1 6 1 1 1 53
symmnumber: 1
zpe: 1352072.7 jmol-1
zpe.correction: 0.514977 hartree
zpe.thermalcorrener: 0.546341 hartree
zpe.thermalcorrenthalpy: 0.547285 hartree
zpe.thermalcorrgfe: 0.447358 hartree
zpe.sumelectzpe: -1671.234877 hartree
zpe.sumelectthermal: -1671.203514 hartree
zpe.sumelectthermalent: -1671.202569 hartree
zpe.sumelectthermalfe: -1671.302496 hartree
dipole: 20.7542 -0.5166 -4.0190
dipole: 21.1460
quadrupole: -229.4082 -231.4620 -204.6588
quadrupole: -7.3495 -2.9814 13.3438
quadrupole: -7.5652 -9.6190 17.1842 -7.3495 -2.9814 13.3438
hfenergy: -1671.7498542 hartree
pointgroup: C01 [X(C26H30I1N3O1Pd1)]
dipole: 8.1706239 -0.2038551 -1.5534688 debye
polarizability: 666.3843241|6.6354376|502.6815524|18.0901|-12.0073262|434.9652373 unknown
InChI: InChI=1S/C14H16NO.2C6H7N.HI.Pd/c1-11-14(13-7-4-3-5-8-13)9-6-10-15(11)12(2)16;2*7-6-4-2-1-3-5-6;;/h3-11,14H,1-2H3;2*1-5H,7H2;1H;/q;;;;+1/p-1
charge 0 multiplicity 1
62 atoms
Pd -1.21385166 0.37441403 -0.46980553
C  0.73221789 -1.05423275 1.58499384
C  -0.55611104 -1.17601278 2.11879901
C  -0.91111454 -0.48029739 3.27609013
C  0.01193547 0.34653892 3.91486463
C  1.30767463 0.45304917 3.40457523
C  1.66280215 -0.24773205 2.25342731
H  -1.29442447 -1.81785665 1.63726776
H  -1.92409187 -0.58038952 3.672445
H  -0.2716413 0.89658404 4.81504282
H  2.04675975 1.08114113 3.90769497
H  2.68146006 -0.16469889 1.86124858
C  -0.9661039 -1.34247489 -1.58839017
C  0.21797515 -0.54586003 -1.71028406
C  1.30671806 -0.69067984 -0.79642228
C  1.16419278 -1.73212296 0.29739666
C  0.30688804 -2.92340011 -0.15167996
H  -1.63553394 -1.40600142 -2.44996018
H  0.33021602 0.11325983 -2.57639793
H  1.82162847 0.22897662 -0.49773651
H  2.16771202 -2.13586753 0.50714752
H  0.02334285 -3.48864972 0.74613788
N  -0.94656336 -2.50935299 -0.77859591
C  -2.04328098 -3.30918209 -0.59166677
C  -3.31215368 -2.90124789 -1.28502758
H  -3.58653655 -1.8659805 -1.02665244
H  -3.19903611 -2.95508944 -2.37865306
H  -4.10666178 -3.58923754 -0.97523123
O  -1.98004689 -4.30699389 0.11742922
C  1.03783707 -3.88448446 -1.08420166
H  0.42725992 -4.78784308 -1.22006249
H  1.19059098 -3.4471331 -2.08328301
H  2.00634571 -4.19668821 -0.66527922
N  -0.60667 2.26007365 0.72832791
H  -1.50024882 2.74149024 0.81019112
H  -0.30943754 1.93911272 1.64880825
C  0.37688775 2.9996049 0.04733411
C  0.01876339 3.80285819 -1.0452729
C  1.72754571 2.89843325 0.40400299
C  0.99581812 4.48222822 -1.76603758
H  -1.03363002 3.8815582 -1.33001083
C  2.69950859 3.582791 -0.32492486
H  2.01226328 2.28559754 1.26151013
C  2.34409882 4.37488643 -1.41574735
H  0.69892421 5.10366419 -2.6145938
H  3.74742899 3.49938068 -0.02587288
H  3.10782954 4.90982785 -1.98409184
N  2.88186138 -1.24193467 -1.74024914
H  2.79019621 -2.22218353 -2.00539592
H  2.83030547 -0.67559687 -2.58728805
C  4.0331611 -0.97404857 -0.96006061
C  4.46583167 0.34837692 -0.81909111
C  4.65265318 -1.99906654 -0.23946708
C  5.51761228 0.63939443 0.04549478
H  3.98138126 1.14691306 -1.38636261
C  5.70389177 -1.696036 0.62310852
H  4.32274506 -3.03395594 -0.35983181
C  6.1359594 -0.37840524 0.7726514
H  5.85625279 1.67255044 0.15035755
H  6.18844647 -2.50025149 1.18070351
H  6.95875861 -0.14507259 1.45144527
I  -3.84705564 0.86665349 0.1088373
