program: Gaussian 16
title: Title
version: ES64L-G16RevC.01
frameworkgroup: C1[X(C20H23IN2OPd)]
method: RPBE1PBE
basis: def2SVP
operation: Freq
keyword: #N
keyword: Geom=AllCheck
keyword: Guess=TCheck
keyword: SCRF=Check
keyword: GenChk
keyword: RPBE1PBE/def2SVP
keyword: Freq
converged: YES YES YES YES
title: Mulliken charges:
elementType: Pd C C C C C C H H H H H C C C C C H H H H H N C C H H H O C H H H N H H C C C C H C H C H H H I
charge: 0.009232 -0.185244 -0.009746 -0.037099 -0.034887 -0.033077 -0.030854 0.045690 0.033137 0.034759 0.034618 0.049948 0.137981 -0.061759 0.040013 -0.177186 0.142427 0.069088 0.052620 0.104320 0.120263 0.065477 -0.326821 0.147039 -0.066179 0.092600 0.093586 0.067973 -0.310108 -0.040727 0.052854 0.078334 0.077094 -0.156315 0.192484 0.200134 0.014166 -0.012016 0.001908 -0.041656 0.037117 -0.047555 0.030138 -0.024635 0.041621 0.041688 0.039416 -0.551859
chargesum: -0.00000
title: Mulliken charges with hydrogens summed into heavy atoms:
elementType: Pd C C C C C C C C C C C N C C O C N C C C C C C I
charge: 0.009232 -0.185244 0.035944 -0.003962 -0.000128 0.001541 0.019093 0.207069 -0.009140 0.144333 -0.056922 0.207904 -0.326821 0.147039 0.187980 -0.310108 0.167555 0.236303 0.014166 0.025101 0.032046 -0.000035 -0.005867 0.014781 -0.551859
1716.lowfreq: -7.1723 -3.1710 -0.0003 0.0002 0.0004 7.8538 12.2566 21.8189 25.1115
frequency: 10.9555 21.7710 25.0908 37.2972 42.7117 57.6252 58.4269 75.4813 85.8364 90.3350 111.9193 116.2586 128.7465 135.8493 147.8827 191.2943 195.6556 214.7180 220.8192 222.2121 232.0878 246.7879 266.1627 298.3684 329.2775 345.3593 399.7048 409.7423 410.0318 423.2107 432.0278 483.0507 505.6471 520.1148 544.5718 545.1153 586.5273 606.9609 612.8854 620.1781 626.7219 651.3866 664.3632 677.2836 719.7485 721.0163 724.2775 752.2739 762.2376 781.8193 831.3304 833.3507 857.9392 858.6203 862.1116 918.2326 932.0541 935.2141 961.4806 961.8403 988.8342 1002.7020 1004.1126 1005.1251 1015.0330 1025.6620 1026.6132 1037.8088 1041.8843 1044.2614 1051.3169 1054.9191 1057.0587 1071.7000 1091.7960 1093.1438 1094.9195 1113.3662 1135.1018 1156.2253 1160.5211 1163.4295 1169.0891 1181.4920 1182.9804 1203.9776 1279.2051 1306.4779 1310.6034 1326.2535 1345.6721 1347.3410 1355.4545 1371.6966 1377.0184 1404.8415 1408.1616 1414.7333 1437.3061 1446.5889 1447.3454 1461.6006 1466.9849 1476.0905 1502.2506 1508.0836 1539.2893 1592.0201 1602.0199 1647.3564 1649.2941 1680.5984 1690.1945 1699.7493 1796.3997 3060.9704 3066.4588 3075.3555 3166.5910 3169.1706 3188.7134 3192.7790 3193.9219 3200.9324 3204.4155 3204.8755 3208.8916 3209.8333 3211.2586 3216.4564 3220.0351 3223.3916 3224.1998 3233.1060 3254.9508 3274.0119 3481.6316 3591.7079
redmass: 5.9282 6.1657 5.8107 4.3279 4.6716 5.9550 5.6572 3.8579 6.5110 9.9785 4.7650 7.9608 5.3319 4.0181 6.4694 2.1062 4.4230 1.7473 4.0148 1.9905 1.7112 3.0188 7.7078 4.3032 3.2175 2.4689 3.4450 3.7480 3.0517 2.9180 3.5612 3.1301 3.3850 4.0128 4.8378 3.0507 4.4808 3.5575 3.6679 6.3426 4.5277 3.3053 1.7407 4.6766 1.7506 1.8912 2.4920 1.3631 2.0170 1.7853 4.8715 2.6459 1.2533 1.2421 1.2389 1.7677 1.3655 1.3965 2.0058 1.3256 1.7145 1.3958 1.3915 5.6269 4.4526 1.3206 1.3139 1.8337 1.3848 1.7842 3.0879 1.6812 2.0112 1.9842 1.4614 1.6623 2.0325 2.4344 1.4920 1.1389 1.0647 1.0783 1.2556 1.0984 1.1062 1.1979 3.1636 1.7853 1.3834 1.6260 1.5856 1.2836 1.2328 1.3831 6.3784 1.8412 6.9882 2.2620 1.1330 1.0501 1.1316 2.2641 1.1343 2.0253 2.2863 2.5495 2.6342 6.8274 1.1259 6.2598 6.3292 6.4420 6.5046 6.1958 10.7699 1.0826 1.0389 1.0389 1.1031 1.1034 1.0878 1.1050 1.0878 1.0902 1.0891 1.0914 1.0899 1.1048 1.0961 1.0928 1.0927 1.0970 1.1003 1.1009 1.0903 1.0982 1.0579 1.0904
irintensity: 0.3850 1.1545 0.5041 0.3642 0.9058 2.1470 1.3385 0.1417 0.4747 17.4311 3.2393 8.2572 6.5599 13.3473 1.1127 14.1614 5.9297 2.0547 5.0841 3.8203 0.7736 1.2914 7.6757 4.2156 3.8105 34.8168 8.7610 6.2100 1.4754 0.3017 3.1792 26.6540 8.4978 5.8611 6.4014 5.5131 16.1105 20.1982 47.1849 0.4157 9.2969 56.3261 37.9303 1.6389 44.6045 90.0216 9.4491 85.8382 38.6473 30.0752 18.8282 23.3603 0.3356 0.7045 0.8018 90.5327 9.8302 3.5589 67.7082 20.9338 34.7407 0.7470 1.6882 45.3168 15.7142 1.3241 11.5601 19.0310 298.0817 24.9682 20.7608 11.1288 21.2081 4.7936 19.7357 16.3583 12.8296 25.1361 25.3564 1.8527 0.1358 0.2834 10.0662 1.3225 0.1433 10.8183 49.6952 252.4768 21.7703 271.0627 17.2940 1.4455 9.5215 44.8681 0.9797 410.0601 1.2502 207.7150 35.0122 14.3940 27.3539 12.5127 5.4585 66.6021 49.7387 7.1711 101.1955 117.6318 88.0273 85.7872 14.2838 3.6816 77.8444 531.8928 435.3475 15.9233 18.7626 1.0371 10.9174 1.0113 1.1332 3.5602 1.4474 3.3896 1.4009 0.5848 3.4985 3.4675 27.0113 2.5160 1.9474 13.9748 30.2225 11.9678 6.4970 1.7256 107.4722 99.5030
temp: 298.150 k
press: 1.00000 atm
elementType: 46 6 6 6 6 6 6 1 1 1 1 1 6 6 6 6 6 1 1 1 1 1 7 6 6 1 1 1 8 6 1 1 1 7 1 1 6 6 6 6 1 6 1 6 1 1 1 53
symmnumber: 1
zpe: 1029861.3 jmol-1
zpe.correction: 0.392253 hartree
zpe.thermalcorrener: 0.417938 hartree
zpe.thermalcorrenthalpy: 0.418882 hartree
zpe.thermalcorrgfe: 0.332080 hartree
zpe.sumelectzpe: -1384.241386 hartree
zpe.sumelectthermal: -1384.215702 hartree
zpe.sumelectthermalent: -1384.214757 hartree
zpe.sumelectthermalfe: -1384.301559 hartree
dipole: -5.0889 -4.3449 -1.0802
dipole: 6.7780
quadrupole: -159.4875 -187.3593 -187.7851
quadrupole: -7.2183 -6.5853 12.5217
quadrupole: 18.7231 -9.1486 -9.5745 -7.2183 -6.5853 12.5217
hfenergy: -1384.6336398 hartree
pointgroup: C01 [X(C20H23I1N2O1Pd1)]
dipole: 1.0320451 1.7039178 -1.7727727 debye
polarizability: 397.6427555|91.798168|445.0620932|-50.3003837|-15.8858877|423.4601054 unknown
InChI: InChI=1S/C8H11NO.C6H7N.C6H5.HI.Pd/c1-7-5-3-4-6-9(7)8(2)10;7-6-4-2-1-3-5-6;1-2-4-6-5-3-1;;/h3-7H,1-2H3;1-5H,7H2;1-5H;1H;/q;;;;+1/p-1
charge 0 multiplicity 1
48 atoms
Pd 0.05616741 0.11900455 -0.46807295
C  0.61573902 1.77107869 -1.41048574
C  0.67779325 3.00415539 -0.75346764
C  1.1656994 4.13099201 -1.41930401
C  1.59694317 4.0351377 -2.74265449
C  1.53706151 2.80634555 -3.3996109
C  1.04578461 1.6763085 -2.73788376
H  0.35768996 3.09452517 0.28826184
H  1.21212051 5.08916648 -0.89471555
H  1.97995597 4.91736859 -3.26124916
H  1.87527163 2.72036682 -4.43578808
H  1.01118923 0.7191604 -3.26687875
C  -3.46510126 -1.34939066 -0.49831443
C  -2.61260073 -1.13052926 -1.51843925
C  -1.87440833 0.11392307 -1.57123844
C  -1.96298963 1.00258116 -0.50890309
C  -2.84261228 0.75843846 0.69466245
H  -4.05187048 -2.2652302 -0.45400492
H  -2.49244676 -1.88477606 -2.29465514
H  -1.49469741 0.46156701 -2.53649957
H  -1.72036045 2.05444996 -0.67320276
H  -3.55169312 1.60368306 0.72878176
N  -3.6739907 -0.45509924 0.53710692
C  -4.78539638 -0.54084865 1.36103821
C  -5.65449367 -1.76635792 1.259031
H  -6.14304629 -1.83514574 0.27583179
H  -5.07824635 -2.68950896 1.41766173
H  -6.42554212 -1.68640328 2.03292568
O  -5.03918295 0.36087973 2.14013288
C  -2.07175603 0.77262899 2.01092561
H  -2.76575271 0.79434112 2.86006966
H  -1.42317451 -0.11117848 2.08312159
H  -1.43794176 1.67175017 2.05163382
N  2.13700173 -0.04439221 0.10695684
H  2.20310117 -1.01761468 0.41522377
H  2.71869359 0.0720243 -0.72224751
C  2.50857584 0.86497342 1.14010942
C  2.04756107 0.65289588 2.4432376
C  3.28500098 1.98698665 0.84672567
C  2.37019171 1.56286303 3.44608521
H  1.42984604 -0.22299165 2.65753849
C  3.59968393 2.89470767 1.8567643
H  3.63593114 2.15386556 -0.17433123
C  3.1443912 2.68867807 3.15816481
H  2.00910795 1.39081085 4.46275702
H  4.20671166 3.77137429 1.6191481
H  3.39211845 3.40214428 3.94708083
I  -0.1622902 -2.41297262 0.75942039
