program: Gaussian 16
title: Template file
version: ES64L-G16RevC.01
frameworkgroup: C1[X(C20H23IN2OPd)]
method: RPBE1PBE
basis: def2SVP
operation: Freq
keyword: #N
keyword: Geom=AllCheck
keyword: Guess=TCheck
keyword: SCRF=Check
keyword: GenChk
keyword: RPBE1PBE/def2SVP
keyword: Freq
converged: YES YES NO YES
title: Mulliken charges:
elementType: Pd C C C C C C H H H H H C C C C C H H H H H N C C H H H O C H H H N H H C C C C H C H C H H H I
charge: 0.039715 -0.267644 -0.043917 -0.010568 -0.035498 -0.023498 0.022000 0.059124 0.036208 0.039069 0.037750 0.062210 0.077537 0.017977 -0.022185 -0.093318 0.030472 0.066761 0.053103 0.103422 0.103739 0.071439 -0.308412 0.157838 -0.068624 0.091382 0.064359 0.095652 -0.330343 0.014811 0.058556 0.054313 0.059280 -0.151157 0.187072 0.193336 0.029691 -0.028487 -0.015498 -0.040199 0.025622 -0.043771 0.029233 -0.025955 0.040509 0.041026 0.037754 -0.491883
chargesum: -0.00000
title: Mulliken charges with hydrogens summed into heavy atoms:
elementType: Pd C C C C C C C C C C C N C C O C N C C C C C C I
charge: 0.039715 -0.267644 0.015206 0.025640 0.003570 0.014253 0.084210 0.144298 0.071079 0.081237 0.010421 0.101911 -0.308412 0.157838 0.182769 -0.330343 0.186960 0.229250 0.029691 -0.002866 0.013734 0.000310 -0.002745 0.011800 -0.491883
1716.lowfreq: -264.4372 -1.2399 -0.0005 -0.0004 -0.0004 4.5662 8.5096 18.9075 23.8422
frequency: -264.4367 18.3628 23.8090 36.1664 51.8893 61.4202 68.5804 71.5318 83.8646 91.1150 107.3468 115.9032 120.5427 138.2625 166.1506 176.7403 184.1901 193.9640 211.7751 228.3516 231.7097 244.1213 258.5374 275.2698 336.7952 358.8448 400.4589 412.7336 424.3453 429.1952 442.2927 482.2447 508.4518 530.8843 541.0265 544.5953 594.2483 613.7250 618.4044 622.5311 624.2236 641.2235 650.8396 672.1186 721.4490 724.9653 727.5709 746.3414 758.0285 779.5912 831.0236 859.1444 861.3472 866.0424 910.7314 919.6366 930.8372 945.0559 956.5910 964.2889 988.0067 997.1337 999.5701 1004.4065 1005.5846 1018.3954 1026.0177 1026.6752 1034.6258 1039.6637 1042.4206 1054.8790 1058.6724 1068.1284 1091.5040 1092.2143 1101.6325 1112.0405 1128.7215 1151.2932 1153.0347 1160.9292 1162.5295 1178.2976 1184.0477 1190.5272 1283.3580 1308.3158 1318.4062 1319.9265 1346.0633 1349.7626 1360.7291 1375.6971 1383.1686 1390.1848 1407.8895 1417.0216 1434.8394 1442.9250 1448.2890 1452.1019 1460.8229 1465.1781 1478.4818 1501.7254 1507.2707 1540.2095 1607.1058 1646.2365 1647.1521 1677.1837 1689.6901 1693.7759 1777.9154 3065.2702 3072.7918 3163.4458 3167.3004 3171.5952 3179.1531 3194.7620 3198.6516 3204.3124 3204.4939 3210.5770 3210.8801 3214.0447 3217.7739 3222.4793 3224.0996 3224.2556 3228.9877 3232.7790 3245.2607 3261.1840 3515.8947 3607.6542
redmass: 6.9411 5.0481 6.0615 6.7300 7.2764 5.1352 4.9977 6.9614 5.4382 5.8501 4.2768 4.4107 4.5868 7.0403 3.0511 1.4416 3.8511 4.0443 5.0337 3.2299 3.5289 1.4202 5.6687 2.4428 2.7732 4.4271 2.8863 3.6708 2.9510 3.0755 3.3305 3.9483 3.2956 3.5965 3.5271 4.3821 4.5588 3.1877 5.0573 2.5474 4.5465 2.2996 5.8277 3.4361 1.7700 3.4871 1.6242 1.8885 1.4013 1.7793 5.0007 1.2898 1.5932 1.6461 1.2578 1.7385 1.3590 1.5914 1.3243 2.1764 1.8093 5.3984 1.5100 1.3615 1.3925 3.5073 1.3740 1.3696 2.2775 2.3901 2.5202 1.7323 2.0181 1.6918 1.6568 1.5553 1.5168 1.2997 2.0099 1.1584 1.2970 1.0628 1.0686 1.2916 1.0992 1.1183 3.1442 2.0323 1.4655 1.3667 1.4528 1.2796 1.2860 1.4926 3.8142 1.8466 6.9003 1.8184 1.3668 1.1269 1.6339 1.1338 1.3533 2.3224 3.3659 2.2036 2.5404 2.6370 1.1274 6.1277 6.1438 6.3464 6.4501 6.4480 10.5990 1.0360 1.0388 1.0986 1.1029 1.1048 1.0927 1.0885 1.0904 1.0880 1.0883 1.1048 1.0894 1.0932 1.0937 1.0945 1.0911 1.0961 1.1005 1.1009 1.0884 1.1007 1.0534 1.0950
irintensity: 29.8416 0.4574 2.3135 3.3418 0.8894 0.4681 1.2977 1.2797 6.2778 1.3241 5.0593 7.9278 10.8437 10.3549 1.6914 0.9635 7.9604 6.5521 0.9931 0.2698 3.8117 4.2431 2.2601 6.6254 15.7204 6.5655 18.5681 14.4958 0.0697 0.4354 3.1724 17.0253 12.6697 5.8681 3.0738 11.3420 24.2605 26.9630 5.1072 22.3994 23.7340 19.1576 14.9994 4.6463 86.8122 4.1864 24.9995 64.3687 42.1792 34.1145 23.1670 1.0010 12.8153 15.5194 3.2738 7.3522 8.1190 11.8015 4.9020 44.2207 39.8118 33.6152 261.0234 21.2680 9.5090 41.1949 13.8698 9.4582 21.1950 15.4033 20.2608 11.6572 12.6605 0.1664 16.2686 5.9743 13.0810 24.6767 9.0591 2.1244 9.3614 0.1880 0.2077 27.4482 1.4043 0.4672 34.8581 113.8745 37.0728 10.9240 29.2555 1.5317 6.1084 23.6413 7.2105 8.7779 2.9778 328.9220 83.7987 27.0042 127.6912 41.2278 35.1292 31.7811 64.1448 41.6748 7.8842 102.1333 76.1270 18.0301 16.5066 5.3733 48.1981 370.8034 504.4760 22.2352 2.5082 8.9156 0.0930 10.1511 11.9011 1.5077 8.6688 3.4671 1.0113 3.9312 2.6034 14.5678 4.4483 2.2841 2.1412 11.8457 25.4628 11.3243 4.1549 2.5812 69.2070 69.6037
temp: 298.150 k
press: 1.00000 atm
elementType: 46 6 6 6 6 6 6 1 1 1 1 1 6 6 6 6 6 1 1 1 1 1 7 6 6 1 1 1 8 6 1 1 1 7 1 1 6 6 6 6 1 6 1 6 1 1 1 53
symmnumber: 1
zpe: 1029694.4 jmol-1
zpe.correction: 0.392190 hartree
zpe.thermalcorrener: 0.416977 hartree
zpe.thermalcorrenthalpy: 0.417921 hartree
zpe.thermalcorrgfe: 0.334858 hartree
zpe.sumelectzpe: -1384.234056 hartree
zpe.sumelectthermal: -1384.209269 hartree
zpe.sumelectthermalent: -1384.208325 hartree
zpe.sumelectthermalfe: -1384.291388 hartree
dipole: -5.5466 -0.9632 0.5410
dipole: 5.6555
quadrupole: -216.3768 -165.0990 -160.0707
quadrupole: -0.0514 -5.7275 -4.7991
quadrupole: -35.8613 15.4165 20.4448 -0.0514 -5.7275 -4.7991
hfenergy: -1384.6262463 hartree
pointgroup: C01 [X(C20H23I1N2O1Pd1)]
dipole: 2.09439 -0.4301372 -0.6159294 debye
polarizability: 461.2803428|28.8433027|379.1575487|-43.7711348|49.7922026|424.7203814 unknown
InChI: InChI=1S/C8H11NO.C6H7N.C6H5.HI.Pd/c1-7-5-3-4-6-9(7)8(2)10;7-6-4-2-1-3-5-6;1-2-4-6-5-3-1;;/h3-7H,1-2H3;1-5H,7H2;1-5H;1H;/q;;;;+1/p-1
charge 0 multiplicity 1
48 atoms
Pd -0.73548389 -0.52372353 -0.18299778
C  0.77189528 -1.41064592 -1.27483774
C  1.95581385 -0.72404131 -1.56361285
C  2.59066863 -0.90954687 -2.79424946
C  2.05888713 -1.78338625 -3.74134287
C  0.88751231 -2.486282 -3.44900447
C  0.25580386 -2.31483177 -2.21872
H  2.39340085 -0.03137601 -0.84184553
H  3.50952203 -0.35805687 -3.01013858
H  2.56035597 -1.92594071 -4.70135278
H  0.46705558 -3.18288464 -4.17865942
H  -0.64488893 -2.89123666 -1.98861124
C  0.69141092 -0.32770214 2.83214696
C  -0.43032802 -1.03152202 2.57856217
C  -0.53347917 -1.86584745 1.38257401
C  0.67071057 -2.14948427 0.65630836
C  1.96886311 -1.74617601 1.3212192
H  0.76557369 0.36141257 3.67336544
H  -1.29074908 -0.9335538 3.23964729
H  -1.36115864 -2.57807697 1.32270111
H  0.71832162 -3.13167428 0.1842071
H  2.7582516 -1.59077942 0.57894752
N  1.81505791 -0.46790792 2.01766364
C  2.77442163 0.5054124 1.85567788
C  2.53905591 1.81456048 2.55678216
H  2.52387319 1.69023142 3.6499102
H  3.35405428 2.49455824 2.28628777
H  1.58053533 2.25825191 2.25008868
O  3.75531051 0.31233726 1.1524788
C  2.41498513 -2.84542298 2.282802
H  3.36739541 -2.5614075 2.75299385
H  1.66856602 -3.01385577 3.07313546
H  2.56670574 -3.7889449 1.7393795
N  -0.76505384 1.10837188 -1.66349106
H  -0.46779639 0.75620369 -2.57232928
H  -1.75340458 1.35744631 -1.71901149
C  0.03617193 2.19991559 -1.22810317
C  1.27143753 2.45965362 -1.82689969
C  -0.39328274 2.99161748 -0.15568387
C  2.08007304 3.48721563 -1.34134749
H  1.59986516 1.85563322 -2.67492637
C  0.41403309 4.02342779 0.3129015
H  -1.35768696 2.78009027 0.31254734
C  1.65873887 4.27224335 -0.27006358
H  3.04665679 3.67600916 -1.81435756
H  0.06847903 4.63596289 1.1491619
H  2.29326843 5.07693828 0.1074026
I  -3.22822666 0.24207855 0.60219682
