program: Gaussian 16
title: -19.88967133
version: ES64L-G16RevC.01
frameworkgroup: C1[X(Cl2Cs2F2Zn)]
method: RPBE1PBE
basis: def2SVP
operation: Freq
keyword: #N
keyword: Geom=AllCheck
keyword: Guess=TCheck
keyword: SCRF=Check
keyword: GenChk
keyword: RPBE1PBE/def2SVP
keyword: Freq
converged: YES YES NO NO
title: Mulliken charges:
elementType: Zn Cl Cl Cs F Cs F
charge: 0.815867 -0.537477 -0.521503 0.713329 -0.559390 0.654793 -0.565620
chargesum: -0.00000
title: Mulliken charges with hydrogens summed into heavy atoms:
chargesum: 0.00000
1716.lowfreq: -11.3024 -0.0065 -0.0062 0.0012 10.6627 18.2372 28.2867 46.5905 66.3093
frequency: 28.0139 30.1818 66.0935 72.5596 90.3847 102.8469 125.5582 134.5054 147.0714 181.9840 200.7998 246.0530 277.5765 476.2968 505.1719
redmass: 66.1104 45.7234 68.9022 37.6559 35.4689 35.9187 24.4850 34.5380 25.7249 21.5341 20.8124 38.4518 38.6578 20.9325 23.8632
irintensity: 9.0778 15.9862 3.1508 15.9622 33.7647 12.7893 4.5450 11.9539 64.7776 70.1760 90.1579 54.4926 53.6644 61.4683 155.8590
temp: 298.150 k
press: 1.00000 atm
elementType: 30 17 17 55 9 55 9
symmnumber: 1
zpe: 16060.4 jmol-1
zpe.correction: 0.006117 hartree
zpe.thermalcorrener: 0.018340 hartree
zpe.thermalcorrenthalpy: 0.019284 hartree
zpe.thermalcorrgfe: -0.039116 hartree
zpe.sumelectzpe: -2938.773271 hartree
zpe.sumelectthermal: -2938.761049 hartree
zpe.sumelectthermalent: -2938.760104 hartree
zpe.sumelectthermalfe: -2938.818504 hartree
dipole: -2.9306 -7.2533 -2.1452
dipole: 8.1118
quadrupole: -7.4795 -105.1124 -103.3665
quadrupole: -4.3929 2.8180 0.1938
quadrupole: 64.5066 -33.1262 -31.3803 -4.3929 2.8180 0.1938
hfenergy: -2938.779388 hartree
pointgroup: C01 [X(Cl2Cs2F2Zn1)]
dipole: 1.1936615 2.7355224 -1.1301565 debye
dipolederiv: 1.895819 0.0691364 0.0940822 0.0830179 1.7936169 0.0187456 0.0972058 0.0280348 1.673624 -0.924274 -0.033389 -0.1042802 -0.0514739 -0.9178273 -0.1660998 -0.133495 -0.1945255 -0.9277432 -1.046442 -0.0392672 0.0088383 -0.0681606 -1.1138592 0.0935591 0.021176 0.1293078 -0.7477139 1.2403409 0.0456635 -0.074673 0.0817348 0.9549191 -0.0661488 -0.1006145 -0.0702964 0.9275424 -1.2668137 -0.0224998 -0.0577864 -0.0039945 -0.8625545 0.1174098 -0.0589654 0.1042393 -0.840047 1.2162766 -0.1017696 0.0487924 -0.1233885 0.9484388 -0.0251986 0.0788518 -0.036866 0.9523894 -1.1149069 0.0821257 0.0850265 0.0822649 -0.8027338 0.0277327 0.0958413 0.0401059 -1.0380516 unknown
polarizability: 116.0539636|-0.5645092|94.3264145|1.5915647|0.5424564|88.768061 unknown
InChI: InChI=1S/2Cl.2Cs.2F.Zn
charge 0 multiplicity 1
7 atoms
Zn -0.04125861 -0.6794091 0.475195
Cl -0.96137574 -1.86774724 -1.28740348
Cl 0.24035039 1.50782048 -0.394668
Cs 3.48745029 0.30143873 -0.23457573
F  1.62668636 -1.23481831 1.14681294
Cs -3.25936571 0.57980087 -0.13107816
F  -1.4443046 -0.48250166 1.72937919
