program: Gaussian 09
title: 000048223
version: EM64L-G09RevD.01
frameworkgroup: C1[X(C14H16N2O4)]
method: RPBEPBE
basis: SDD
operation: Freq
keyword: #p
keyword: freq=noraman
keyword: PBEPBE/SDD
title: #p freq=noraman PBEPBE/SDD
converged: YES YES NO NO
title: Mulliken charges:
elementType: O O O O N N C C C C C C C C C C C C C C H H H H H H H H H H H H H H H H
charge: -0.452704 -0.249999 -0.396266 -0.261322 -0.456024 -0.572269 0.302833 0.143967 0.055842 -0.548543 0.042747 -0.368257 0.406189 -0.432126 -0.435953 -0.623923 -0.385359 -0.244461 0.077877 0.228076 0.249398 0.199303 0.390036 0.244495 0.192877 0.241550 0.229756 0.254839 0.250243 0.172966 0.218262 0.225190 0.274382 0.258368 0.385191 0.382821
chargesum: 0.00000
title: Mulliken charges with hydrogens summed into heavy atoms:
elementType: O O O O N N C C C C C C C C C C C C C C
charge: -0.067513 -0.249999 -0.013445 -0.261322 -0.065988 -0.039518 0.302833 0.143967 0.055842 -0.099842 0.042747 0.069116 0.406189 -0.190576 -0.206197 -0.118841 0.005870 -0.019271 0.077877 0.228076
polarizability: 2.36760010e+02 1.78662579e+01 2.28591742e+02 -1.16502102e+01 4.08943284e+00 1.05487954e+02
1716.lowfreq: -4.1626 -2.7787 -0.0008 -0.0007 -0.0007 6.4328 18.9560 32.1145 51.4550
frequency: 18.9321 32.1123 51.4535 57.0259 62.4950 72.8501 91.4494 105.3084 110.8402 128.1458 168.9520 205.9393 223.3613 226.2893 244.7323 272.8560 294.0396 336.5288 347.3320 387.6841 425.3594 447.8706 466.4600 515.1396 548.3493 549.5845 564.0981 575.4482 581.6127 591.8704 603.2937 642.9450 659.0695 698.2257 732.7423 741.6945 744.5177 752.6097 763.7533 795.0084 798.6097 860.0286 864.0332 870.7401 902.2463 929.9102 959.4554 965.4151 973.1784 1020.6735 1024.2768 1057.8823 1073.8015 1087.5359 1110.6839 1138.8188 1155.1716 1171.6426 1186.5382 1206.0516 1222.0402 1244.2279 1273.7059 1281.4457 1284.2427 1291.9869 1294.9417 1321.1258 1337.9143 1350.9419 1361.1970 1385.0779 1403.1661 1426.6500 1448.4033 1453.7527 1462.8788 1472.8619 1490.0379 1495.9034 1555.6377 1587.0493 1620.5739 1636.3777 1643.3806 1650.8657 2850.5019 2974.6798 2979.1473 2994.3067 3018.0720 3049.7709 3071.3377 3103.4341 3125.5605 3137.5088 3160.7831 3460.2973 3486.2436 3502.1851 3543.2152 3589.5945
redmass: 4.7340 5.8912 7.5079 3.4684 2.0855 9.4353 5.4721 7.7591 2.8445 5.1128 4.8223 2.8226 1.8190 2.8744 2.4305 3.6305 5.4241 5.9191 6.0892 2.7664 5.8986 3.2017 3.6122 3.5239 4.1225 1.6714 3.4228 1.5382 2.5274 2.9687 4.2753 2.1784 2.6880 3.2095 3.1442 6.2362 1.3626 1.5961 1.3522 2.7373 3.3046 2.1545 3.3480 2.5013 1.6189 2.0658 1.9258 1.3550 4.7404 3.8624 2.3953 2.0523 2.1360 1.9446 2.5558 1.4578 2.5725 1.2849 1.1946 2.3957 1.3764 1.8038 1.3138 1.4650 1.2259 1.2092 1.8259 2.6543 1.4547 2.7622 2.0357 1.4405 2.9212 4.6000 1.1021 4.4828 1.1113 1.1210 1.1009 3.5015 8.9324 6.5571 7.3327 1.0965 7.7059 7.9812 1.0717 1.0637 1.0660 1.0656 1.0855 1.0940 1.1014 1.0956 1.0868 1.0908 1.0989 1.0447 1.0824 1.0643 1.0645 1.0980
irintensity: 0.2173 0.7171 0.8653 2.6838 3.2778 1.3711 0.5878 0.6230 2.3673 0.9508 0.5038 9.7076 36.2178 8.8914 15.0007 0.4302 1.4973 7.6282 2.0515 5.5645 2.0804 43.1153 10.1472 5.5132 51.7705 71.8721 37.3181 140.7353 96.1620 44.8689 18.4046 66.7675 84.2618 26.0809 53.9487 3.8080 13.6132 55.7539 82.1024 12.9257 8.4180 2.2611 3.7245 14.8706 0.6826 37.9908 26.1032 2.8922 197.0728 29.6263 143.0562 46.4156 69.8576 139.3628 40.1420 72.4334 44.6787 0.7946 27.1800 2.3558 0.9301 8.3798 4.6089 9.5535 1.7966 8.4286 39.5362 99.2129 24.4361 150.1420 26.1802 17.5547 1.4258 55.9780 12.5227 7.0357 2.2201 12.3170 5.5931 7.4688 80.3140 3.7422 2.6192 38.1973 50.0184 563.8338 120.4903 11.9389 41.2309 13.1086 32.5092 6.6094 31.1011 4.6570 4.4835 14.1068 29.0978 1.4253 277.2116 17.6645 58.7892 0.1948
temp: 298.150 k
press: 1.00000 atm
elementType: 8 8 8 8 7 7 6 6 6 6 6 6 6 6 6 6 6 6 6 6 1 1 1 1 1 1 1 1 1 1 1 1 1 1 1 1
symmnumber: 1
zpe: 743106.5 jmol-1
zpe.correction: 0.283034 hartree
zpe.thermalcorrener: 0.302550 hartree
zpe.thermalcorrenthalpy: 0.303494 hartree
zpe.thermalcorrgfe: 0.232903 hartree
zpe.sumelectzpe: -952.058535 hartree
zpe.sumelectthermal: -952.039019 hartree
zpe.sumelectthermalent: -952.038075 hartree
zpe.sumelectthermalfe: -952.108666 hartree
dipole: -2.5173 -2.2705 -0.1906
dipole: 3.3954
quadrupole: -98.6387 -107.9949 -118.3895
quadrupole: -11.2375 -3.6400 -0.0768
quadrupole: 9.7023 0.3461 -10.0484 -11.2375 -3.6400 -0.0768
hfenergy: -952.3415689 hartree
pointgroup: C01 [X(C14H16N2O4)]
dipole: 1.0721145 -0.7968465 -0.009845 debye
polarizability: 239.1229153|-15.9600721|225.4300785|-16.7584965|2.646397|106.2867118 unknown
InChI: InChI=1S/C14H16N2O4/c15-6-2-5-10-9-4-1-3-8(7-11(17)18)12(9)16-13(10)14(19)20/h1,3-4,16-17,19H,2,5-7,15H2
charge 0 multiplicity 1
36 atoms
O  -0.335951 3.577443 -0.125152
O  -2.430772 2.85727 0.611526
O  5.170894 0.528476 0.307521
O  3.407452 1.988227 -0.043837
N  0.679772 1.082009 -0.255755
N  -5.832132 -1.430506 -0.915595
C  -1.216971 -0.004322 0.482479
C  -0.174621 -0.978598 0.24753
C  0.996081 -0.268364 -0.213205
C  -2.626818 -0.291515 0.928854
C  -0.652518 1.250294 0.169792
C  -3.557165 -0.691651 -0.253202
C  2.201366 -0.940742 -0.558557
C  -0.123966 -2.392108 0.39287
C  2.214591 -2.338871 -0.387058
C  3.4018 -0.215037 -1.167626
C  -4.987705 -1.018295 0.222074
C  1.073221 -3.057676 0.084889
C  -1.258261 2.573112 0.254288
C  3.953481 0.880133 -0.269289
H  -3.050367 0.601464 1.421321
H  -2.618531 -1.114663 1.671703
H  1.351406 1.845993 -0.39094
H  -3.60805 0.131195 -0.988662
H  -3.129576 -1.570167 -0.77952
H  -1.000355 -2.948901 0.742049
H  3.126501 -2.894157 -0.637354
H  3.09807 0.272241 -2.115105
H  4.201853 -0.937266 -1.388382
H  -4.927406 -1.778911 1.042085
H  -5.43162 -0.107027 0.666704
H  1.140676 -4.145341 0.194031
H  -6.837144 -1.451992 -0.721567
H  -5.51002 -2.280808 -1.388085
H  -0.779537 4.463097 -0.046114
H  5.482324 1.260366 0.908089
