program: Gaussian 16
title: iodobenzene
version: ES64L-G16RevC.01
method: RMN15L
basis: def2SVP
operation: Freq
keyword: #P
keyword: Geom=AllCheck
keyword: Guess=TCheck
keyword: SCRF=Check
keyword: GenChk
keyword: RMN15L/def2SVP
keyword: Freq
converged: YES YES NO YES
title: Mulliken charges:
elementType: C C C C C C H H H H H I
charge: 0.015429 -0.245337 0.015292 -0.033969 -0.029695 -0.033975 0.042288 0.042309 0.046155 0.043018 0.046156 0.092327
chargesum: 0.00000
title: Mulliken charges with hydrogens summed into heavy atoms:
elementType: C C C C C C I
charge: 0.057717 -0.245337 0.057602 0.012186 0.013323 0.012181 0.092327
polarizability: 9.92998792e+01 -2.01462564e+01 1.22543745e+02 3.38093678e-02 -6.25315097e-02 4.20258408e+01
1716.lowfreq: -0.0004 -0.0003 -0.0001 2.9016 14.3822 20.2383 154.7418 225.6168 271.2941
frequency: 154.7409 225.5906 271.2940 409.8827 461.6348 614.5901 661.7817 708.9744 745.6605 849.6141 922.3093 985.5189 1006.6741 1007.0941 1047.2418 1090.9240 1101.5351 1171.0792 1196.2783 1321.7909 1391.0809 1474.9394 1506.1154 1647.1019 1649.6384 3184.0598 3192.8804 3203.7391 3208.7090 3213.7180
redmass: 4.7563 4.8076 9.8546 2.9420 3.4558 6.3166 6.5838 2.4567 1.4755 1.2495 1.3215 1.3588 1.2548 6.8126 4.1943 1.9517 1.4899 1.0690 1.1160 1.3138 8.6145 2.2908 2.2074 6.0545 6.4458 1.0846 1.0891 1.0934 1.0971 1.1010
irintensity: 1.0334 0.1643 0.2546 0.0000 9.0785 0.2570 17.6473 21.4806 45.4031 0.0000 0.6835 0.0002 0.0219 25.7797 14.3593 13.6048 4.2030 0.0775 0.0257 2.0723 0.3418 11.4613 37.8609 32.3848 2.5432 0.1449 4.0627 1.6090 3.9001 6.9538
temp: 298.150 k
press: 1.00000 atm
elementType: 6 6 6 6 6 6 1 1 1 1 1 53
symmnumber: 1
zpe: 237017.3 jmol-1
zpe.correction: 0.090275 hartree
zpe.thermalcorrener: 0.096138 hartree
zpe.thermalcorrenthalpy: 0.097082 hartree
zpe.thermalcorrgfe: 0.058546 hartree
zpe.sumelectzpe: -527.848266 hartree
zpe.sumelectthermal: -527.842404 hartree
zpe.sumelectthermalent: -527.841459 hartree
zpe.sumelectthermalfe: -527.879996 hartree
dipole: -0.7137 1.2368 -0.0010
dipole: 1.4280
quadrupole: -50.3715 -54.4664 -67.4089
quadrupole: -8.0393 0.0088 -0.0076
quadrupole: 7.0441 2.9492 -9.9933 -8.0393 0.0088 -0.0076
hfenergy: -527.9385412 hartree
pointgroup: C01 [X(C6H5I1)]
dipole: -0.2808101 0.4866026 -0.0004064 debye
dipolederiv: -0.1798225 0.1524089 -0.0001516 0.2836616 -0.2632604 0.000236 -0.0002373 0.0002019 -0.0711526 0.2236085 -0.5163318 0.0004943 -0.5150511 0.8209023 -0.0008512 0.0005083 -0.0008828 -0.1419284 -0.0539626 0.2108793 -0.0001329 0.078757 -0.3898778 0.0002549 -0.0000642 0.000302 -0.0710896 0.0460251 -0.0280516 0.0000725 0.0849303 0.0726844 -0.0000883 0.0000014 -0.0001286 -0.1060189 -0.0695492 -0.053448 0.0000613 -0.052175 -0.0088396 -0.0001035 0.0000494 -0.000092 -0.1191463 0.0897608 0.0600718 0.0000116 -0.0544752 0.0279053 -0.0001104 0.0001099 -0.0000736 -0.1059534 0.0752246 -0.0244383 0.0000057 -0.0504972 0.0008469 0.0000635 0.0000237 0.0000703 0.1183917 -0.0121365 0.0005588 -0.0000491 0.0265675 0.0889752 0.0000287 -0.0000593 0.0000188 0.1183648 0.0240785 -0.0378002 -0.0000106 -0.040934 -0.0580055 0.0001117 -0.0000106 0.0001075 0.124296 0.0363882 0.0605673 -0.0000736 0.0603271 -0.0329351 0.0001333 -0.0000678 0.0001263 0.1261588 -0.0704149 0.0143158 -0.000073 0.0177441 0.0377326 0.0000667 -0.0000831 0.0000629 0.1242718 -0.1092002 0.1612681 -0.0001548 0.1611447 -0.2961283 0.0002587 -0.0001704 0.0002872 0.0038061 unknown
polarizability: 99.2998792|-20.1462564|122.5437448|0.0338094|-0.0625315|42.0258408 unknown
InChI: InChI=1S/C6H5I/c7-6-4-2-1-3-5-6/h1-5H
charge 0 multiplicity 1
12 atoms
C  -6.79802188 1.21094211 0.00012736
C  -5.39199161 1.22317244 0.00056969
C  -4.67830293 2.43462557 0.00003475
C  -5.38835283 3.64766482 -0.00105737
C  -6.79345351 3.650896 -0.00155824
C  -7.49334126 2.43236411 -0.00092627
H  -7.34646179 0.2551734 0.00059884
H  -3.57634955 2.43178618 0.00043271
H  -4.83093967 4.59892224 -0.00149673
H  -7.34453751 4.60524752 -0.00241129
H  -8.5958643 2.42547003 -0.00128327
I  -4.33374455 -0.61115072 0.00225506
