program: Gaussian 16
title: dippf-Ph rad free
version: ES64L-G16RevC.01
method: UMN15L
basis: def2SVP
operation: Freq
keyword: #P
keyword: Geom=AllCheck
keyword: Guess=TCheck
keyword: SCRF=Check
keyword: GenChk
keyword: UMN15L/def2SVP
keyword: Freq
converged: YES YES YES YES
polarizability: 4.09080373e+02 4.82506674e+01 4.23534895e+02 -3.70721823e+01 3.49902133e+01 3.33832447e+02
1716.lowfreq: -143.6022 -11.8618 -4.3391 -3.6990 -0.0019 0.0015 0.0031 30.3739 34.2788
frequency: -143.6001 30.1441 34.2756 38.3708 42.7515 52.2088 70.4987 73.5989 87.2538 96.0021 106.5825 112.5487 119.0458 132.7778 134.4497 139.7408 149.5247 159.5520 164.1883 176.7924 189.4531 208.5146 225.3682 235.0224 241.9973 245.6010 249.5368 256.0936 264.9453 278.8704 288.2364 289.1386 296.5925 310.1368 318.0432 335.9908 342.2568 357.2907 358.5446 378.5750 385.4101 388.2445 393.0182 399.8128 417.0993 421.7814 431.2538 453.9578 461.3300 469.3475 483.2535 500.7456 524.7584 545.1044 553.6714 562.7228 581.4647 588.5329 593.4992 604.8633 612.9745 618.0571 634.4132 645.6393 665.7355 701.3396 718.3840 831.4607 839.1165 842.8624 845.1735 852.9278 856.3400 871.8698 876.5350 883.8891 897.9758 900.9996 903.4522 904.9753 905.8781 909.8529 912.2693 916.1164 918.9652 920.2410 922.1048 923.7846 934.7871 951.9234 965.2314 966.9902 970.0892 972.1579 976.0256 997.7064 1026.4767 1026.7824 1028.7758 1037.0375 1048.4789 1051.6852 1057.5443 1058.4168 1067.0965 1071.8792 1081.6564 1086.5806 1088.6635 1119.6699 1120.8574 1135.8180 1147.1590 1163.0401 1178.7343 1179.1429 1181.4651 1182.3206 1185.3345 1198.5464 1202.3012 1217.1002 1219.6999 1254.0846 1261.2513 1265.8947 1273.2691 1305.7174 1309.6040 1323.7421 1327.3469 1341.1562 1352.6497 1365.9000 1368.6037 1373.5010 1377.7978 1382.6438 1388.6668 1390.7840 1391.9974 1394.8280 1396.1454 1431.5209 1433.7527 1444.6695 1449.3202 1455.4059 1455.8254 1456.7841 1458.3472 1460.4947 1461.3569 1462.7836 1464.8981 1466.3409 1467.3717 1471.4900 1476.4296 1477.0613 1478.2812 1480.8867 1481.3459 1482.7205 1483.3064 1485.6995 1498.7244 1609.4151 1645.8557 3004.4613 3010.9951 3011.3668 3013.2079 3013.3514 3014.2568 3014.8387 3015.2384 3016.9759 3023.4144 3029.1216 3036.6982 3111.1548 3111.1813 3111.3924 3113.3814 3115.0461 3116.6058 3123.5189 3124.7260 3133.7068 3137.5877 3139.7151 3140.6142 3141.7276 3144.1382 3144.8034 3145.9443 3163.5876 3164.0345 3171.0202 3181.1108 3197.9044 3214.4485 3219.5679 3220.3079 3233.9475 3240.6490 3246.6329 3261.3061 3305.0494
redmass: 6.6570 3.7722 4.8828 4.3366 4.4864 3.6014 3.0430 3.8981 3.6725 3.5696 3.2305 3.9972 4.1628 3.5700 2.7525 3.4113 3.2096 4.0361 3.5436 3.0991 3.3515 3.6237 1.5231 2.1086 1.2290 1.6921 1.5937 1.6398 1.8224 2.4678 1.6792 1.1612 2.2863 2.1989 2.4017 3.9759 1.1371 2.4756 2.5139 2.8370 2.2401 1.9270 2.7900 3.1720 3.6839 2.8475 3.3814 1.8580 4.9152 2.4527 3.9615 5.7912 6.7975 10.0336 6.9075 6.4143 4.7617 5.2342 5.0667 6.2779 5.2989 5.5179 5.0891 4.4467 3.5394 3.9167 1.1782 1.2459 1.2670 3.1130 4.0100 1.2423 1.2182 1.2314 1.3519 1.6783 1.3706 1.4968 2.0464 1.2542 1.5552 1.1903 1.7787 1.5022 1.8973 1.4708 1.9120 1.3183 1.4918 5.6700 1.3657 1.3603 1.3462 1.4054 1.3315 1.2456 1.3159 4.6794 1.3114 1.2756 1.3393 1.2886 1.5740 1.5968 1.3536 1.5234 1.1894 1.4454 1.2941 2.3538 2.5936 2.4326 2.4358 1.0809 1.8866 1.1990 1.8715 1.8757 1.9664 4.7537 5.0850 1.6115 1.5275 1.5055 1.4180 1.4234 1.3028 1.3157 1.3562 1.3210 1.3126 1.3058 3.5113 3.2083 1.3018 1.3420 1.3028 1.3299 1.2416 7.8798 1.2488 1.2548 1.2460 5.6427 3.5761 3.6321 4.5853 1.0829 1.0546 1.1223 1.0867 2.1781 1.3389 1.5206 1.7376 1.1051 1.0624 1.1495 1.1318 1.1926 1.5689 1.0441 1.0566 1.0580 1.0596 1.0509 1.0643 5.5485 6.6320 1.0713 1.0376 1.0394 1.0402 1.0414 1.0446 1.0383 1.0407 1.0383 1.0813 1.0818 1.0830 1.1025 1.1017 1.1022 1.1003 1.1010 1.1026 1.1017 1.1029 1.1029 1.1029 1.1025 1.1016 1.0868 1.1009 1.0883 1.0997 1.0916 1.1017 1.0934 1.0972 1.0977 1.0924 1.0918 1.0927 1.0967 1.0975 1.1026 1.0992 1.0943
irintensity: 2.0785 0.0558 0.2539 0.4544 0.0360 0.0494 0.0569 0.4933 0.4695 0.3650 0.6725 0.9674 0.6682 0.9087 0.0169 0.3775 0.0878 0.5320 1.3723 0.0036 0.3875 1.4890 0.4316 1.2782 0.1759 0.8256 2.0542 0.9743 1.3669 0.8586 0.7151 0.4084 2.8114 0.2423 0.1921 0.8898 0.2190 0.8014 0.5736 2.5957 1.3180 2.8923 0.2204 4.3091 1.6204 0.5596 3.7736 2.9574 9.2503 14.2758 28.2623 8.3254 30.4232 4.9977 43.1228 29.6727 11.2395 5.4364 0.8663 0.1570 9.1450 0.3624 15.7739 6.2340 7.6869 3.0647 63.9212 0.0096 0.9590 1.1871 0.6188 3.9206 33.8009 3.8605 2.9911 0.2568 0.5888 0.5591 1.8808 1.0842 1.2523 1.2302 8.9351 0.5904 8.4367 3.7754 3.9483 0.5069 5.9190 66.6582 0.5894 0.2027 0.5572 1.1043 0.1235 0.2111 11.3699 1.0459 6.2625 3.9959 15.9334 5.3779 3.6440 0.6533 4.3865 12.5644 21.9131 2.4321 1.5964 11.9015 0.8952 1.5103 3.5668 0.0162 3.1536 0.8634 1.8860 2.8481 2.7462 2.3886 29.2081 11.2168 1.3553 6.9584 24.2086 3.3454 9.4760 1.2832 0.6985 0.1424 0.6800 0.5436 6.6053 3.7163 2.0962 2.0595 3.9588 1.9967 3.2006 0.7286 7.6492 3.7648 1.4006 2.0831 2.8543 0.7343 1.5630 2.0732 1.8688 0.3542 0.0856 9.2013 2.2560 8.5849 2.3003 6.8069 1.6538 4.2103 15.2999 10.1363 9.9596 5.7227 8.3084 9.2527 2.7393 5.4360 4.0118 36.8390 0.3944 1.4337 13.6914 24.2566 56.1338 8.2799 15.8416 81.1568 36.3588 42.2226 25.7073 21.7700 8.1450 19.4926 13.2620 18.7037 37.2461 25.7972 18.0452 30.8040 32.0178 16.9779 16.7570 18.1522 26.1554 3.6826 10.2126 9.7762 5.8040 11.2710 7.8087 30.6108 5.8793 23.6225 1.4409 0.1949 1.2320 1.6801 0.8464 1.6320 6.9929 1.3269
temp: 298.150 k
press: 1.00000 atm
elementType: 26 15 15 6 6 6 1 6 1 6 1 6 1 6 1 6 1 6 1 6 1 6 6 6 6 1 6 1 6 1 1 1 6 1 6 1 6 1 1 1 6 1 1 1 6 1 1 1 6 1 1 1 6 1 6 1 6 1 1 1 6 1 1 1 6 1 1 1 6 1 1 1
symmnumber: 1
zpe: 1625996.0 jmol-1
zpe.correction: 0.619309 hartree
zpe.thermalcorrener: 0.653262 hartree
zpe.thermalcorrenthalpy: 0.654206 hartree
zpe.thermalcorrgfe: 0.555761 hartree
zpe.sumelectzpe: -3034.845144 hartree
zpe.sumelectthermal: -3034.811192 hartree
zpe.sumelectthermalent: -3034.810247 hartree
zpe.sumelectthermalfe: -3034.908693 hartree
dipole: 0.0614 1.5810 0.7379
dipole: 1.7458
quadrupole: -214.8293 -217.6429 -221.1454
quadrupole: 3.8156 -1.4229 6.9105
quadrupole: 3.0432 0.2296 -3.2728 3.8156 -1.4229 6.9105
hfenergy: -3035.4644535 hartree
pointgroup: C01 [X(C28H41Fe1P2)]
dipole: 0.0241695 0.6220167 0.290307 debye
polarizability: 409.0803733|48.2506674|423.5348949|-37.0721823|34.9902133|333.8324468 unknown
InChI: InChI=1S/2C11H18P.C6H5.Fe/c2*1-9(2)12(10(3)4)11-7-5-6-8-11;1-2-4-6-5-3-1;/h2*5-10H,1-4H3;1-5H;
charge 0 multiplicity 2
72 atoms
Fe 2.62898507 2.2173861 -3.48615016
P  4.66313079 4.93038517 -4.32676511
P  0.47739556 0.79801465 -1.2302871
C  4.37053644 3.28410099 -3.57850374
C  0.80087078 1.67745182 -2.80005018
C  0.82545731 3.09804308 -3.09316798
H  0.59394392 3.90960194 -2.39755271
C  1.19076778 3.28517988 -4.46592561
H  1.35087778 4.25494859 -4.96219122
C  1.36183479 1.99070203 -5.05635223
H  1.67001868 1.78644266 -6.09127976
C  1.12619826 0.9989988 -4.04757621
H  1.22602906 -0.08446664 -4.19759882
C  4.08475472 2.88158755 -2.21658355
H  3.95733046 3.55901563 -1.35712996
C  3.98646306 1.44720151 -2.17834602
H  3.74621257 0.83419247 -1.2978145
C  4.20751526 0.94549902 -3.50423281
H  4.14935527 -0.10927623 -3.81180398
C  4.43138436 2.07091743 -4.36681032
H  4.59701544 2.03534223 -5.4543588
C  0.73582136 -1.54843649 -2.1373622
C  2.09987172 -1.8370731 -2.22877125
C  -0.1999695 -2.16147982 -2.97712254
C  2.54932296 -2.75096559 -3.20285366
H  2.82352055 -1.33227969 -1.56004264
C  0.25323252 -3.06348046 -3.96438321
H  -1.28295676 -1.95161798 -2.88896892
C  1.62579368 -3.34858914 -4.08202261
H  3.62480817 -2.99044237 -3.28623736
H  -0.47030377 -3.54648973 -4.64479042
H  1.97730902 -4.04782146 -4.85865005
C  6.55460953 4.94596447 -4.35518212
H  6.79913447 5.95884203 -4.75668175
C  4.31383102 6.07599193 -2.88285541
H  4.81152802 5.67104364 -1.96931887
C  7.23506487 4.75674262 -2.9922143
H  7.03470841 5.59239287 -2.29011801
H  6.89381614 3.8118894 -2.51254993
H  8.33852036 4.68761638 -3.11742772
C  7.07451548 3.90510067 -5.36208549
H  6.52375441 3.94360747 -6.32685334
H  8.15258064 4.07496973 -5.5718711
H  6.97690255 2.87802211 -4.94893118
C  4.87088927 7.47790157 -3.18169891
H  4.56198336 8.19186043 -2.38756669
H  5.97912757 7.49756161 -3.23727536
H  4.47315696 7.85846727 -4.14914692
C  2.7994981 6.14252981 -2.63202634
H  2.39165341 5.1448972 -2.37850674
H  2.56944704 6.84067858 -1.79738563
H  2.26744915 6.50847352 -3.53925595
C  0.7628226 1.95236608 0.26115439
H  -0.08234589 1.62276303 0.91625275
C  -1.39050556 0.65266511 -1.28359156
H  -1.55546037 0.23837168 -2.30668648
C  -2.15121766 1.98104333 -1.17346336
H  -2.07224087 2.40221669 -0.14696497
H  -1.77777433 2.73920076 -1.89482238
H  -3.23307367 1.82256902 -1.37665231
C  -1.88898323 -0.36686469 -0.24761779
H  -2.98324453 -0.53071351 -0.35711449
H  -1.37244838 -1.34388068 -0.35180575
H  -1.71857158 0.00180852 0.78907816
C  2.07381909 1.57380197 0.97813003
H  2.08218002 1.98738486 2.01025765
H  2.22203994 0.47499882 1.03835554
H  2.94744353 2.01255307 0.44871533
C  0.70456214 3.4827527 0.1289868
H  1.57919873 3.85015813 -0.4509836
H  -0.22074392 3.85768815 -0.35083909
H  0.76923087 3.94023383 1.14187253
