program: Gaussian 16
title: dppf-Me radical formn
version: ES64L-G16RevC.01
method: UMN15L
basis: def2SVP
operation: Freq
keyword: #P
keyword: Geom=AllCheck
keyword: Guess=TCheck
keyword: SCRF=Check
keyword: GenChk
keyword: UMN15L/def2SVP
keyword: Freq
converged: YES YES YES YES
polarizability: 5.34607513e+02 3.97915802e+01 3.80753694e+02 -2.14364669e+00 3.25820607e+01 4.13602165e+02
1716.lowfreq: -309.8563 -5.8631 -0.0047 -0.0042 -0.0041 3.8048 10.4940 18.5297 23.7695
frequency: -309.8563 18.3381 23.1618 32.6550 36.7011 40.3260 54.4704 59.5228 62.9434 76.3482 81.2082 84.5095 94.8864 98.5036 112.5245 127.4671 144.8411 168.2624 182.7592 196.2188 198.7219 211.3085 226.8893 233.4185 239.5482 245.7930 266.0181 270.9991 277.0735 278.8862 284.6184 335.1037 386.2350 401.9382 405.3407 409.3717 411.0047 415.6803 421.6930 426.7968 439.1769 454.0178 460.1880 472.7727 483.4230 503.4805 512.2875 517.8034 523.5580 527.3454 541.4955 551.7074 561.6129 583.0699 597.7428 619.5097 621.3657 621.6915 622.4579 626.4948 640.9627 679.9044 695.5298 700.3381 707.6572 717.8823 719.6207 720.2157 729.4508 757.3543 762.1067 764.1499 771.1107 816.8862 829.0842 834.3076 840.0642 843.9367 848.4241 861.4821 863.0511 864.3476 867.8979 870.3375 877.1375 886.7046 895.4905 898.3858 904.8461 906.9626 928.0137 929.6368 940.2097 952.9914 988.2850 990.4351 992.4334 1005.6814 1007.9206 1008.3975 1008.6964 1014.2709 1014.6487 1015.2033 1015.9651 1021.2573 1044.9564 1051.3177 1055.5445 1057.7125 1058.6628 1061.8964 1063.3443 1075.7475 1078.0526 1080.2457 1100.2913 1103.3078 1105.0683 1107.6160 1109.9379 1123.8125 1128.7783 1129.1003 1168.2163 1169.9241 1171.0519 1171.3257 1195.0004 1197.3657 1202.5316 1204.6223 1205.2165 1208.2823 1217.4657 1219.1500 1319.1651 1319.2797 1327.0192 1329.3987 1361.9798 1370.9009 1389.2822 1391.3485 1395.3201 1396.5734 1396.7730 1402.9507 1428.5568 1438.5132 1443.1402 1451.3162 1462.5411 1464.9406 1468.1795 1469.1665 1472.0394 1473.6678 1509.4244 1513.6652 1517.6343 1518.3349 1638.1215 1638.8663 1642.5153 1642.5590 1653.0505 1658.8513 1660.2749 1661.5498 3050.9336 3153.0514 3165.4258 3165.9394 3166.9082 3170.9212 3177.5142 3177.9666 3178.1517 3178.5334 3183.7682 3187.2205 3187.9665 3188.7466 3194.9846 3195.3610 3200.0258 3200.5037 3205.9345 3206.1867 3218.9057 3219.2625 3229.1811 3235.1070 3241.6196 3244.5964 3247.4363 3257.4079 3258.5268 3259.3529 3269.9769
redmass: 8.5471 6.0291 5.5191 3.9370 4.0205 5.1932 5.2984 5.3743 4.9163 5.1296 4.9957 4.7935 4.0416 4.7890 5.2063 3.9662 4.1790 4.3675 3.7620 4.6177 4.3119 5.2120 4.1036 4.7507 4.8147 4.7054 3.4662 4.4516 1.3772 4.2516 5.0969 5.1842 5.6738 2.8719 2.9786 3.1918 4.8844 5.5738 5.8893 3.3390 4.6430 5.3588 6.0773 4.0839 1.3807 3.8040 4.3298 4.0932 4.2462 5.8492 8.3160 2.7392 2.2620 4.8664 5.0192 6.3669 6.3202 6.2960 6.3277 7.3901 8.6440 5.8136 6.3659 6.2796 6.6096 1.6406 1.6403 1.6390 2.0629 2.1289 2.0033 2.1791 1.8147 1.2218 1.1892 1.2874 2.1708 1.5276 3.0181 1.2539 1.2330 1.2370 1.2530 1.3141 1.2646 1.2519 1.2235 3.1454 2.2810 1.4337 1.3462 1.3502 1.3409 1.3258 1.3676 1.3643 1.3726 1.3251 1.3160 1.2639 1.2498 5.1503 6.0419 5.9313 5.7019 1.2721 1.3160 3.2686 2.5621 2.7098 2.7819 1.4347 1.5421 1.3908 1.2844 1.1598 1.5741 1.5087 2.0707 1.5850 1.5450 2.6956 2.7150 2.7690 1.0707 1.0717 1.0679 1.0662 1.1237 1.1265 1.1296 4.8166 1.1755 4.9326 1.4748 1.4711 1.3846 1.3684 1.3638 1.3762 4.0967 4.0429 5.3957 5.6466 2.4697 6.7659 1.6062 1.1103 6.1744 4.0954 3.7845 4.7583 2.8307 2.9330 2.3413 2.3502 2.3384 2.3699 2.2079 2.2310 2.1966 2.1738 5.9172 5.9140 6.0060 6.0019 6.0906 6.1151 6.0132 6.0009 1.0145 1.0891 1.0880 1.0875 1.0863 1.0871 1.0857 1.0862 1.0893 1.0900 1.0906 1.0906 1.0911 1.0953 1.0959 1.0958 1.1002 1.0978 1.1006 1.1006 1.0906 1.0957 1.0944 1.0914 1.1035 1.0933 1.1142 1.0971 1.1094 1.1043 1.0989
irintensity: 1.4979 0.0490 0.0083 0.2326 0.0257 0.0434 0.1593 0.0767 0.0307 0.3410 0.2128 0.4944 0.2578 0.0243 0.2545 0.4313 0.0782 0.5557 0.9835 0.1195 0.3299 1.4687 0.3006 0.4258 1.7388 1.2706 1.6525 1.0534 0.9667 1.5638 8.0406 0.4426 15.6767 0.1005 0.1566 1.0182 0.1436 3.5769 18.1666 5.2447 1.7655 14.5426 19.1204 7.9168 5.7307 42.2976 46.8574 15.0509 13.6445 35.6838 9.4955 13.7673 11.5578 0.5609 0.7467 0.1584 0.2969 0.0938 0.1099 1.4333 6.6485 2.1862 1.0830 3.2950 3.0055 30.6434 58.4557 30.5763 33.5064 14.5553 27.3121 7.7604 21.6380 0.0253 9.7018 4.2836 5.9930 21.8910 1.2466 1.6172 3.7928 1.7921 1.9100 1.0230 2.5395 2.1194 0.2071 1.2025 3.9944 1.2827 0.3831 1.3952 0.3377 1.5959 0.0784 0.1032 0.1743 0.3330 0.2762 0.0051 0.1237 1.5725 1.9825 1.5408 1.3530 0.0532 9.4968 0.3077 0.4017 2.3824 2.9230 6.0676 9.1087 18.2139 9.1006 9.4650 7.3747 4.9340 9.0197 1.1245 1.8500 12.4784 3.6129 8.2100 0.2104 0.5543 0.0519 0.0090 1.8393 2.6243 5.7376 3.5579 10.9808 37.6351 14.4394 3.0316 3.6968 5.4226 2.0094 2.6683 3.2532 6.1604 0.4701 0.8935 1.5385 0.6140 0.6432 2.2679 2.2169 1.8396 0.8389 2.5461 0.4911 4.5646 17.3660 12.6519 9.4414 8.1824 4.1246 4.2946 14.8589 14.6319 1.3242 2.7451 2.3333 0.1734 0.9179 1.5401 7.8420 10.4299 10.0068 1.9773 1.6393 2.0058 0.3274 0.5807 0.4761 0.6188 0.9064 0.1482 3.0871 1.4642 3.7929 11.3263 12.5445 12.9269 15.8351 11.7787 24.2009 18.5357 1.9534 3.0917 0.9727 1.6960 2.2580 1.5601 5.5695 0.5023 5.0489 0.0580 1.7232
temp: 298.150 k
press: 1.00000 atm
elementType: 26 15 15 6 6 6 6 1 6 1 6 1 6 1 6 1 6 6 1 6 1 6 1 6 1 6 1 6 1 6 1 6 1 6 1 6 1 6 1 6 1 6 1 6 6 1 6 1 6 1 6 1 6 1 6 6 1 6 1 6 1 6 1 6 1 6 1 1 1
symmnumber: 1
zpe: 1448096.5 jmol-1
zpe.correction: 0.551551 hartree
zpe.thermalcorrener: 0.584892 hartree
zpe.thermalcorrenthalpy: 0.585836 hartree
zpe.thermalcorrgfe: 0.485608 hartree
zpe.sumelectzpe: -3295.279281 hartree
zpe.sumelectthermal: -3295.245939 hartree
zpe.sumelectthermalent: -3295.244995 hartree
zpe.sumelectthermalfe: -3295.345224 hartree
dipole: -1.0711 0.1288 1.5002
dipole: 1.8478
quadrupole: -249.3660 -251.8674 -245.0067
quadrupole: -9.6309 11.4341 9.2550
quadrupole: -0.6193 -3.1207 3.7400 -9.6309 11.4341 9.2550
hfenergy: -3295.8308315 hartree
pointgroup: C01 [X(C35H31Fe1P2)]
dipole: -0.4213948 0.0506903 0.5902143 debye
polarizability: 534.6075131|39.7915802|380.753694|-2.1436467|32.5820607|413.6021652 unknown
InChI: InChI=1S/2C17H14P.CH3.Fe/c2*1-3-9-15(10-4-1)18(17-13-7-8-14-17)16-11-5-2-6-12-16;;/h2*1-14H;1H3;
charge 0 multiplicity 2
69 atoms
Fe 2.55802876 2.65161413 -4.28438512
P  4.90777023 5.14271982 -3.94127889
P  0.74088479 0.91585891 -2.08371094
C  4.43018089 3.38707469 -4.12570565
C  0.81471618 2.22433641 -3.3539362
C  1.19080548 1.89253232 -0.54425446
C  0.31705845 2.82756655 0.05971715
H  -0.62410441 3.10013557 -0.45160805
C  0.62738629 3.38859244 1.30862471
H  -0.06879197 4.10542518 1.77673974
C  1.81596167 3.02647047 1.97004552
H  2.04823699 3.45299823 2.96054164
C  2.71013315 2.12847729 1.36367767
H  3.64643352 1.84807596 1.8748066
C  2.39359127 1.56201159 0.11528643
H  3.07132716 0.82050863 -0.34820698
C  -1.06273688 0.70035533 -1.748756
C  -2.0599955 1.06439009 -2.67780558
H  -1.77593818 1.55937455 -3.62272481
C  -3.41505282 0.80555361 -2.40507821
H  -4.18483454 1.10232026 -3.13692947
C  -3.78954367 0.17766447 -1.20594305
H  -4.85250622 -0.02373744 -0.99413521
C  -2.80112225 -0.19311272 -0.27654559
H  -3.08648913 -0.68689572 0.66726997
C  -1.44863781 0.06455554 -0.54674536
H  -0.67525319 -0.22012734 0.18957983
C  1.18007045 3.61280919 -3.14733025
H  1.39253806 4.08637025 -2.17702174
C  1.28960415 4.24093419 -4.43396865
H  1.59327851 5.27937816 -4.62279374
C  0.99145349 3.26542428 -5.44021071
H  1.01543101 3.42889874 -6.52673379
C  0.70305247 2.02295567 -4.7868267
H  0.46138986 1.08274273 -5.29782656
C  4.18849865 2.37730278 -3.11615986
H  4.2172312 2.52903202 -2.02833986
C  3.84477881 1.15251096 -3.7796535
H  3.55346039 0.21490522 -3.28086151
C  3.86922418 1.38520179 -5.1967731
H  3.61544485 0.65104335 -5.97532732
C  4.23578733 2.75600781 -5.4138045
H  4.32343399 3.26490562 -6.38487093
C  6.59209887 4.96099631 -3.20362239
C  7.38457252 3.80637643 -3.38744012
H  6.97715409 2.9395708 -3.93513024
C  8.69165051 3.74974111 -2.87130918
H  9.29555355 2.83891154 -3.01984162
C  9.22499897 4.83899192 -2.1642061
H  10.24801732 4.78914517 -1.75651074
C  8.44491943 5.99525446 -1.97940635
H  8.85444209 6.85636107 -1.42534137
C  7.14446394 6.05790471 -2.49988451
H  6.53613387 6.96818202 -2.34979666
C  3.94265234 5.65131996 -2.44631833
C  2.91606233 6.60662148 -2.61001462
H  2.77362544 7.07537488 -3.59979538
C  2.07242606 6.95176037 -1.53883618
H  1.26546694 7.6880698 -1.68866517
C  2.2669088 6.36170601 -0.27951394
H  1.60509003 6.62019151 0.56457403
C  3.32716009 5.45567983 -0.08728608
H  3.50684071 5.0219987 0.9087232
C  4.1603499 5.10533543 -1.15927198
H  5.0019518 4.4088744 -0.99643497
C  0.63504044 -0.95157762 -3.70868752
H  0.65751578 -1.81197951 -3.02022656
H  -0.33074618 -0.78653108 -4.218566
H  1.54099871 -0.80846331 -4.32449717
