program: Gaussian 16
title: dppf-Ph rad free
version: ES64L-G16RevC.01
method: UMN15L
basis: def2SVP
operation: Freq
keyword: #P
keyword: Geom=AllCheck
keyword: Guess=TCheck
keyword: SCRF=Check
keyword: GenChk
keyword: UMN15L/def2SVP
keyword: Freq
converged: YES YES YES YES
polarizability: 6.33085261e+02 3.85922812e+01 5.00965210e+02 -4.96799505e+01 1.34797524e+01 4.23027678e+02
1716.lowfreq: -104.0714 -0.0026 -0.0023 0.0041 2.3654 6.5296 10.8768 16.0294 17.9437
frequency: -104.0707 15.9760 17.7775 24.2247 35.9294 41.3152 46.6989 52.8293 60.4853 61.2822 64.4625 72.2268 84.5061 88.6427 95.2466 99.4030 112.8667 120.2218 131.5099 142.2240 152.5295 178.8307 198.3287 202.8328 209.5854 228.3394 232.8994 237.9954 260.1098 266.3659 279.0678 285.3983 291.7682 338.1709 371.7852 394.8595 405.5498 407.2636 409.8167 415.4034 415.7445 425.2279 427.8855 432.4934 434.2426 454.9937 466.9799 474.7262 501.3875 510.0295 514.4646 523.1901 527.1689 531.6793 551.5534 570.9726 579.7546 595.0813 601.4803 613.3357 621.1842 621.6019 622.8043 623.3615 634.0617 694.4916 696.7672 699.1790 706.5655 712.1494 719.3795 719.8072 721.4535 722.8826 729.7265 757.8524 761.7746 763.8388 770.7243 820.2973 834.5240 842.0021 845.0950 847.3635 852.1792 863.0960 864.4018 866.1584 871.6515 873.6878 882.4974 886.4146 896.0798 901.3949 903.5985 906.4299 906.8733 929.7387 937.8229 943.7841 953.0187 953.8704 974.6948 990.2192 994.2292 994.6910 998.6503 1007.1227 1008.6013 1009.2786 1012.7928 1014.4794 1015.7342 1016.1616 1017.7256 1020.4320 1028.0480 1044.8183 1055.7685 1056.0231 1057.0092 1058.5262 1062.0283 1062.7601 1063.7859 1074.5820 1081.1845 1083.2108 1092.2976 1103.6809 1106.9798 1110.2928 1115.1821 1123.0003 1127.7132 1127.9185 1130.1698 1164.7537 1168.4919 1171.2738 1171.4667 1172.3691 1184.7619 1196.6665 1197.4601 1200.5774 1205.9214 1207.7600 1208.2301 1220.5881 1225.1699 1310.5707 1319.0944 1323.2750 1330.1107 1332.0535 1357.9618 1374.4182 1389.8265 1390.9635 1391.4506 1395.6962 1397.9573 1429.0514 1439.1879 1445.6956 1454.9666 1461.7644 1462.5263 1466.0597 1468.0819 1468.5033 1472.2240 1473.2861 1480.1023 1513.8966 1516.1815 1517.9281 1519.7583 1611.6888 1638.7306 1639.2385 1642.4778 1643.3704 1650.0531 1657.3191 1658.1972 1659.7224 1660.8422 3148.6935 3164.4741 3167.5359 3171.8774 3173.2745 3173.7805 3174.7788 3177.3079 3178.0285 3182.4931 3183.9293 3185.7561 3186.6562 3187.7918 3193.6452 3195.1457 3196.8983 3199.6461 3201.8266 3203.2016 3205.9636 3206.9584 3210.8596 3218.1000 3222.1569 3226.7284 3229.7588 3234.1538 3235.3218 3242.6876 3248.8565 3266.8105 3268.5399
redmass: 7.4791 6.0317 5.7630 5.0956 4.2348 4.3859 5.6095 4.8561 5.2696 4.6500 5.3617 5.3250 4.5917 5.5235 5.0713 4.9195 5.3369 5.4930 5.0334 4.8514 4.6522 4.5205 4.6824 4.7946 5.1235 4.7278 4.5145 5.2793 5.0743 4.7058 4.8097 5.1365 4.9935 5.8244 6.9499 2.8414 3.0188 3.5520 5.0897 5.9839 3.1560 5.3021 3.7722 6.1397 3.9252 7.3486 8.6056 5.4739 4.6307 5.0666 5.4949 4.5042 6.3021 7.8835 7.2563 6.9927 4.8706 5.1649 6.2866 7.6085 6.2984 6.3263 6.3166 6.6028 8.2983 6.3695 3.2763 5.7618 6.5907 6.3997 1.6469 1.6797 1.5948 1.4373 1.9900 1.9182 1.9925 2.0384 1.8894 1.2167 1.8953 1.8768 1.2474 1.8301 1.9068 1.2437 1.2289 1.2470 1.2282 1.2626 1.4878 1.2372 2.1052 1.2737 1.5940 1.9701 1.3106 1.3505 1.3728 1.3498 1.6871 2.8299 1.3894 1.3644 1.3565 1.3566 1.2586 1.3287 1.2505 1.3399 1.2509 5.9808 5.4314 5.7740 4.5595 1.2612 6.1581 1.3064 2.5407 2.6445 2.0107 2.7989 1.6013 1.7289 1.6811 1.6027 1.1542 1.2193 1.5291 1.5028 1.5330 1.5472 1.5743 2.6604 2.6747 2.6393 2.6996 1.0721 1.0680 1.0701 1.0661 1.0650 1.1233 3.4010 1.3139 1.1375 1.1933 2.3408 1.4576 1.4554 1.4298 1.2915 1.3867 1.3729 1.3778 1.3718 3.8286 4.2504 7.9510 5.7720 5.7032 6.9993 7.4183 5.8967 4.2197 3.7058 4.7983 2.7000 2.3493 2.9039 2.3344 2.3624 2.3396 2.3640 2.1484 2.2353 2.2224 2.1622 2.1594 5.5658 5.9010 5.7981 5.9914 6.0217 6.7003 6.0783 6.1095 5.9770 5.9860 1.0870 1.0851 1.0871 1.0873 1.0847 1.0878 1.0909 1.0896 1.0861 1.0925 1.0890 1.0902 1.0897 1.0912 1.0940 1.0960 1.0935 1.0987 1.0974 1.0959 1.1006 1.0996 1.0965 1.0967 1.0896 1.0919 1.0942 1.0946 1.0923 1.1032 1.0972 1.0970 1.0998
irintensity: 4.2649 0.0630 0.0525 0.0450 0.0110 0.0482 0.2322 0.1922 0.0689 0.1416 0.1919 0.2796 0.1076 0.5372 0.3007 0.5498 1.3262 0.0357 1.1067 0.3970 0.1327 1.7875 0.2131 0.0172 2.5086 0.9469 0.2805 0.5662 0.7354 0.4596 1.4500 7.4998 9.5740 2.2311 12.2754 0.1708 0.0486 3.6048 0.9248 19.2417 2.8989 2.6855 1.9928 18.1913 4.2128 23.7472 12.8374 11.6554 104.4271 20.3803 5.9577 8.3578 27.7047 13.5773 12.9027 48.2940 2.0218 1.3699 0.1198 0.7636 0.2675 0.6837 0.1935 1.6968 1.9522 1.2112 12.0017 0.3153 3.0661 7.2037 49.4777 35.6075 67.2610 10.1552 32.8539 13.8165 26.1720 13.8266 18.9587 0.9136 4.0371 0.7586 0.5036 12.6767 11.6480 1.3441 3.5753 1.3804 4.4871 2.0729 0.3308 2.5152 7.2229 0.5011 1.2713 5.7338 0.0378 1.6194 6.8157 0.6773 50.3129 71.8036 0.4717 0.1146 0.2151 0.3345 0.1446 0.1364 0.1469 0.3309 0.3800 1.8928 0.2748 1.7994 0.9647 0.3006 0.8343 9.9253 0.6316 1.3610 3.7799 3.3890 6.4758 0.9190 7.8706 11.3703 1.1821 8.0526 1.9911 4.9858 2.6919 2.0706 3.5115 12.2115 0.4502 7.7829 8.2165 0.0273 0.8618 0.0393 0.0274 0.1265 4.1871 2.2506 4.6482 2.9823 14.4482 13.0637 10.8241 16.4453 1.7865 1.1239 3.3528 2.3871 2.6596 1.7187 3.6321 5.5319 0.5986 1.1384 0.3250 1.1807 1.3274 4.5197 1.7816 0.8942 2.2720 3.2701 6.1232 3.6455 15.0859 13.3621 8.0278 8.7239 40.8268 4.1991 5.1779 16.7868 14.0236 78.3782 2.7292 1.5827 0.6178 0.6060 0.9655 1.0022 1.6906 3.4022 11.4169 1.3942 5.1627 1.8600 0.5968 0.0538 2.2869 16.4512 1.1720 0.5784 19.8919 3.1283 2.2586 4.5863 3.0426 7.8411 13.2944 7.8526 38.9917 11.0166 3.1749 21.4497 13.4351 5.3190 5.6870 1.2322 1.7145 0.8082 1.7933 1.8357 2.3633 3.6229 0.2092 0.8635
temp: 298.150 k
press: 1.00000 atm
elementType: 26 15 15 6 6 6 6 1 6 1 6 1 6 1 6 1 6 6 1 6 1 6 1 6 1 6 1 6 1 6 1 6 1 6 1 6 1 6 1 6 1 6 1 6 6 1 6 1 6 1 6 1 6 1 6 6 1 6 1 6 1 6 1 6 1 6 6 6 6 1 6 1 6 1 1 1
symmnumber: 1
zpe: 1594214.5 jmol-1
zpe.correction: 0.607204 hartree
zpe.thermalcorrener: 0.643474 hartree
zpe.thermalcorrenthalpy: 0.644418 hartree
zpe.thermalcorrgfe: 0.536537 hartree
zpe.sumelectzpe: -3486.626639 hartree
zpe.sumelectthermal: -3486.590369 hartree
zpe.sumelectthermalent: -3486.589425 hartree
zpe.sumelectthermalfe: -3486.697307 hartree
dipole: 0.9703 -0.5372 1.2809
dipole: 1.6943
quadrupole: -282.2322 -269.0171 -273.9610
quadrupole: -11.4428 4.5875 12.5173
quadrupole: -7.1621 6.0530 1.1091 -11.4428 4.5875 12.5173
hfenergy: -3487.2338436 hartree
pointgroup: C01 [X(C40H33Fe1P2)]
dipole: 0.381747 -0.2113702 0.5039296 debye
polarizability: 633.0852608|38.5922812|500.9652096|-49.6799505|13.4797524|423.0276775 unknown
InChI: InChI=1S/2C17H14P.C6H5.Fe/c2*1-3-9-15(10-4-1)18(17-13-7-8-14-17)16-11-5-2-6-12-16;1-2-4-6-5-3-1;/h2*1-14H;1-5H;
charge 0 multiplicity 2
76 atoms
Fe 2.87125115 2.48231195 -4.36042205
P  5.19293053 5.01317816 -3.97432628
P  0.14463736 1.19397069 -2.32812432
C  4.72471255 3.24920997 -4.11976909
C  0.9978014 2.16808451 -3.6143759
C  0.88492314 1.88358627 -0.78671715
C  0.11680182 2.71654594 0.05336332
H  -0.92677832 2.94881967 -0.21718009
C  0.66348665 3.22042253 1.24783834
H  0.048657 3.85780692 1.90465972
C  1.9767561 2.88688629 1.61590191
H  2.39765536 3.26496439 2.56301664
C  2.7594605 2.07643072 0.77266936
H  3.79444323 1.81851978 1.05532775
C  2.21703016 1.58039788 -0.42269998
H  2.81642598 0.91965674 -1.07258992
C  -2.19774869 0.51113523 -1.33815035
C  -3.06586273 1.59799522 -1.46091928
H  -2.6951605 2.58642277 -1.79058866
C  -4.43354222 1.41241257 -1.17467935
H  -5.1338923 2.26216331 -1.25495803
C  -4.90696992 0.14092371 -0.80441583
H  -5.97810052 -0.00700159 -0.58944774
C  -4.01924392 -0.94574556 -0.72412278
H  -4.3948799 -1.94646908 -0.44704529
C  -2.6455326 -0.76669811 -0.99922365
H  -1.96167672 -1.6314683 -0.94397631
C  1.42341981 3.54285139 -3.42133817
H  1.53198128 4.04686798 -2.44748296
C  1.70883161 4.11007049 -4.70969089
H  2.09708963 5.11755391 -4.90674807
C  1.47149156 3.10782412 -5.70507394
H  1.63703208 3.21794288 -6.78609869
C  1.0230388 1.92128229 -5.0417254
H  0.73638409 0.9882778 -5.54587945
C  4.43999637 2.29331985 -3.07362445
H  4.42090828 2.50906298 -1.99754589
C  4.15636257 1.02754193 -3.68142279
H  3.88133532 0.10418834 -3.15086575
C  4.257142 1.18208645 -5.10642578
H  4.07020726 0.39902224 -5.85566437
C  4.61884393 2.54463184 -5.38004518
H  4.7570764 2.99963597 -6.37184111
C  6.80438756 4.85122889 -3.08467533
C  7.61367664 3.69821264 -3.19166863
H  7.25608555 2.82492622 -3.7633551
C  8.87387384 3.65093409 -2.56961224
H  9.49064554 2.74113098 -2.66000274
C  9.34404725 4.7484871 -1.8310245
H  10.33014987 4.70637518 -1.34004057
C  8.54775953 5.90298834 -1.72201405
H  8.90743314 6.77078732 -1.14428659
C  7.2939582 5.95655833 -2.3482383
H  6.6738618 6.86653882 -2.2573867
C  4.10285401 5.60624261 -2.59798844
C  3.11861044 6.57105155 -2.90716311
H  3.08309725 6.99105948 -3.92792093
C  2.18239839 6.98649007 -1.94411564
H  1.41054649 7.72732416 -2.21068094
C  2.24078103 6.46227068 -0.64236076
H  1.50875695 6.78042119 0.11888248
C  3.25913408 5.55272484 -0.30179781
H  3.33617474 5.1752453 0.7296687
C  4.18404954 5.12934698 -1.2684519
H  4.99215646 4.4317823 -0.98500286
C  0.85252008 -0.50000457 -2.34491266
C  1.44829108 -1.10826344 -3.47141795
C  0.71916442 -1.26298761 -1.15817788
C  1.89339825 -2.44075845 -3.41342781
H  1.61262707 -0.52955116 -4.39256505
C  1.16893665 -2.59008442 -1.10160233
H  0.2603456 -0.79798471 -0.26703614
C  1.75409138 -3.18737772 -2.23257946
H  2.36167831 -2.89476176 -4.30262365
H  1.06421595 -3.16168813 -0.16446241
H  2.1061773 -4.23105219 -2.1902368
