program: Gaussian 16
title: dppf
version: ES64L-G16RevC.01
method: RMN15L
basis: def2SVP
operation: Freq
keyword: #P
keyword: Geom=AllCheck
keyword: Guess=TCheck
keyword: SCRF=Check
keyword: GenChk
keyword: RMN15L/def2SVP
keyword: Freq
converged: YES YES YES YES
title: Mulliken charges:
elementType: Fe P P C C C C H C H C H C H C H C C H C H C H C H C H C H C H C H C H C H C H C H C H C C H C H C H C H C H C C H C H C H C H C H
charge: -0.045679 0.540809 0.547369 -0.368773 -0.363053 -0.306641 0.034123 0.039259 -0.031492 0.034963 -0.023916 0.040015 -0.050675 0.039362 0.055285 0.024216 -0.308147 -0.010561 0.049902 -0.019630 0.034052 -0.030835 0.035873 -0.029992 0.036294 0.021874 0.029044 0.043563 0.025375 -0.015896 0.033461 0.002240 0.051226 0.004680 0.048944 0.019663 0.023245 -0.014863 0.049100 -0.012735 0.051842 0.019937 0.047187 -0.300024 0.003153 0.044040 -0.025462 0.033483 -0.031803 0.034261 -0.030284 0.034729 0.010565 0.029220 -0.311326 0.032401 0.031690 -0.039642 0.038659 -0.031733 0.033578 0.003293 0.025771 0.030293 0.035124
chargesum: -0.00000
title: Mulliken charges with hydrogens summed into heavy atoms:
elementType: Fe P P C C C C C C C C C C C C C C C C C C C C C C C C C C C C C C C C C C
charge: -0.045679 0.540809 0.547369 -0.368773 -0.363053 -0.306641 0.073382 0.003471 0.016100 -0.011313 0.079501 -0.308147 0.039341 0.014422 0.005038 0.006302 0.050918 0.068939 0.017565 0.053466 0.053624 0.042908 0.034237 0.039107 0.067125 -0.300024 0.047194 0.008020 0.002458 0.004445 0.039785 -0.311326 0.064091 -0.000982 0.001845 0.029064 0.065416
chargesum: 0.00000
polarizability: 5.32104448e+02 1.43125165e+01 3.46048601e+02 3.98404663e+00 1.56363314e+01 3.81559958e+02
1716.lowfreq: -3.4252 -0.0048 -0.0047 -0.0042 4.3402 7.5828 18.4287 20.3893 34.1726
frequency: 17.8921 20.1497 34.1509 36.9494 44.3686 48.7072 59.4816 62.6347 75.8100 79.4266 84.2251 90.2549 108.7639 119.2316 143.5703 177.3243 191.6070 196.7166 211.2505 221.1095 228.3332 239.7551 241.4663 264.1679 272.4781 279.1174 280.5900 337.8412 402.9951 404.0677 405.4359 411.6499 415.9719 419.7961 424.6340 429.6606 442.4626 460.7573 463.4078 479.0919 505.6603 513.3488 519.2934 525.3181 526.4569 542.0212 556.4797 582.3846 597.4123 620.5483 621.3482 621.6269 622.4069 626.1256 639.9809 694.8771 696.6053 705.7000 707.5192 717.6134 718.2491 719.3643 728.0949 760.4528 761.6885 765.2972 770.0216 818.0071 834.9691 839.1675 843.9715 850.3438 862.2844 863.2846 865.7547 866.6871 871.5875 880.8915 883.8577 895.4134 898.5901 903.1441 909.9250 928.9638 929.3708 938.7195 950.5018 989.2819 990.0728 990.9519 1004.1880 1008.0528 1008.4068 1009.4125 1014.4721 1014.7924 1015.2025 1015.7703 1017.8170 1044.3462 1050.8460 1054.6910 1055.9364 1057.2731 1057.6870 1058.1410 1067.3215 1075.6551 1078.9013 1102.9189 1106.0399 1108.4793 1109.8309 1122.1955 1123.7413 1128.0297 1128.5214 1168.6060 1171.0523 1171.2827 1171.3430 1196.3238 1200.2271 1203.6547 1205.4997 1207.1223 1210.2726 1218.8934 1220.2867 1318.7643 1322.7704 1328.4697 1329.8686 1371.3179 1377.7970 1390.5472 1391.1806 1395.7303 1396.0874 1426.9761 1435.3191 1443.6566 1448.0023 1464.3550 1466.3054 1468.6821 1469.3925 1472.3724 1473.2573 1513.0917 1514.9611 1517.1610 1517.4191 1638.6034 1639.5822 1642.4065 1642.4326 1657.0307 1658.0136 1660.4542 1660.5617 3160.0240 3164.6972 3166.9108 3170.2348 3172.8092 3177.2751 3177.8038 3178.7222 3183.3916 3183.8030 3187.5133 3189.1966 3192.1063 3194.9296 3197.0572 3200.5741 3201.9719 3205.7736 3206.3275 3218.5614 3220.7855 3224.7300 3230.1430 3234.6508 3240.6850 3245.7483 3253.2928 3262.9441
redmass: 5.9918 5.9384 4.2919 3.9500 4.8911 5.2360 5.1644 5.1123 4.6438 5.8630 5.2623 4.9994 6.2925 5.6666 4.3679 4.5646 4.6359 4.6811 5.1487 4.6743 4.4274 4.8642 5.2752 4.7670 4.7736 4.7581 5.3540 5.2195 3.0797 3.7768 2.9624 4.2411 8.0092 5.8831 3.2778 6.7024 5.3272 8.5403 6.3266 5.6045 4.5637 4.6388 5.3074 6.4332 5.6597 6.9828 7.6369 4.8852 5.0272 6.3654 6.3399 6.3169 6.3241 7.7480 8.7855 6.3627 6.3271 6.4897 6.5345 1.7156 1.6200 1.6401 1.9500 2.0421 2.0166 2.1592 1.9245 1.2307 1.3215 2.7241 1.3677 3.2510 1.2541 1.2513 1.2522 1.2117 1.2988 1.2705 1.2330 1.2523 1.4157 2.3038 3.1031 1.3505 1.3515 1.3465 1.3308 1.3707 1.3645 1.3692 1.3343 1.2968 1.2500 1.2545 5.9977 6.1552 5.0072 5.9247 1.2754 1.3069 1.3499 2.1583 2.7057 2.1913 2.0175 2.7784 1.5598 1.2224 1.2271 1.5091 1.5227 1.5408 1.5437 2.6885 2.7186 2.7083 2.7271 1.0687 1.0701 1.0668 1.0673 1.1285 1.1279 1.1415 1.1596 3.6967 3.8393 1.6368 1.5034 1.3841 1.3782 1.3630 1.3769 4.5330 4.3908 5.9794 5.7800 6.9554 7.1560 6.1685 4.2944 3.5755 4.6238 3.0139 2.9448 2.3582 2.3761 2.3437 2.3590 2.2347 2.2093 2.1782 2.1600 5.9050 5.8869 5.9938 5.9811 6.0681 6.1105 5.9891 5.9822 1.0886 1.0873 1.0871 1.0873 1.0863 1.0897 1.0861 1.0855 1.0909 1.0903 1.0912 1.0910 1.0963 1.0960 1.0954 1.0977 1.1004 1.1006 1.1006 1.0916 1.0959 1.0910 1.0936 1.0923 1.0977 1.1033 1.1041 1.0966
irintensity: 0.1185 0.0508 0.3224 0.2604 0.0794 0.0827 0.0516 0.0434 0.3751 0.2487 0.3161 0.0867 0.1851 0.2649 0.1265 1.8399 0.1743 0.4282 0.0521 1.1549 0.8025 1.5708 0.2259 0.1671 3.4180 3.6536 2.9984 1.2023 1.4599 0.4018 0.1668 1.0619 4.1583 3.4509 0.7298 16.3626 12.3484 15.8228 17.9517 9.5183 68.5352 28.6056 15.9592 13.3535 22.3691 15.0860 7.0759 0.8139 0.2871 0.3406 0.2645 0.5793 0.1002 1.9703 4.4380 1.3046 2.4005 2.0623 3.8187 58.3128 39.1314 29.4704 32.2638 10.5420 35.5239 15.6407 16.2469 0.4964 3.3759 2.9793 25.6952 1.3335 0.6427 0.4823 2.5081 7.5233 2.7804 1.1305 2.1663 0.2090 0.8705 1.3579 2.9086 1.4395 1.2021 0.2587 1.9511 0.0494 0.0993 0.4159 0.3842 0.2601 0.1382 0.0027 1.8903 1.8607 1.1114 1.5945 0.2735 0.6604 24.9359 1.1462 0.4186 1.6659 6.8784 3.0035 13.3657 1.4465 6.9536 5.2681 2.3999 1.4478 2.0771 11.5965 10.7792 4.3940 6.6330 0.5838 0.1679 0.0172 0.0102 2.1233 2.0381 8.6420 7.2022 4.7312 30.4656 27.5139 0.6182 3.3347 3.4061 2.1808 2.7984 0.8779 7.7061 0.0855 1.0530 0.9587 0.9148 0.6868 1.7402 1.6422 2.1442 0.4445 5.7916 19.6722 6.1588 7.6658 9.7186 4.2443 6.5759 16.8569 12.8444 2.5570 1.6389 1.6054 0.2744 0.7189 2.5216 16.5337 1.2053 2.2055 2.6083 1.9784 0.5443 0.0980 1.0835 0.5818 0.5688 1.0763 3.3442 3.1872 5.5277 8.7219 13.7623 9.1523 11.7506 11.7047 22.3352 20.4578 1.8134 4.5903 0.0803 0.6677 2.8383 0.8110 2.5508 2.1693 0.3145
temp: 298.150 k
press: 1.00000 atm
elementType: 26 15 15 6 6 6 6 1 6 1 6 1 6 1 6 1 6 6 1 6 1 6 1 6 1 6 1 6 1 6 1 6 1 6 1 6 1 6 1 6 1 6 1 6 6 1 6 1 6 1 6 1 6 1 6 6 1 6 1 6 1 6 1 6 1
symmnumber: 1
zpe: 1360018.9 jmol-1
zpe.correction: 0.518004 hartree
zpe.thermalcorrener: 0.549065 hartree
zpe.thermalcorrenthalpy: 0.550009 hartree
zpe.thermalcorrgfe: 0.454481 hartree
zpe.sumelectzpe: -3255.567772 hartree
zpe.sumelectthermal: -3255.536712 hartree
zpe.sumelectthermalent: -3255.535767 hartree
zpe.sumelectthermalfe: -3255.631296 hartree
dipole: -0.9441 0.4052 1.4444
dipole: 1.7725
quadrupole: -241.5301 -240.9943 -237.1259
quadrupole: -11.2137 10.2693 8.8894
quadrupole: -1.6467 -1.1108 2.7575 -11.2137 10.2693 8.8894
hfenergy: -3256.0857763 hartree
pointgroup: C01 [X(C34H28Fe1P2)]
dipole: -0.3714256 0.1594055 0.5682641 debye
polarizability: 532.1044478|14.3125165|346.0486015|3.9840466|15.6363314|381.5599579 unknown
InChI: InChI=1S/2C17H14P.Fe/c2*1-3-9-15(10-4-1)18(17-13-7-8-14-17)16-11-5-2-6-12-16;/h2*1-14H;
charge 0 multiplicity 1
65 atoms
Fe 2.5592686 2.43108502 -4.20887082
P  4.87672577 4.95474383 -3.84906454
P  0.46820057 0.82016776 -2.04929145
C  4.41957591 3.19030927 -3.98666678
C  0.77080376 2.06147933 -3.34586661
C  1.09555305 1.67250375 -0.52985431
C  0.34835432 2.63617683 0.1878944
H  -0.63321802 2.964291 -0.19703195
C  0.83478925 3.15671456 1.39797136
H  0.23411442 3.89513478 1.95595462
C  2.08059794 2.73910263 1.8994589
H  2.45491681 3.14178073 2.85582831
C  2.85148733 1.8137592 1.17569365
H  3.83016899 1.48380325 1.56225248
C  2.35171901 1.27317106 -0.0218469
H  2.93455272 0.50874075 -0.56781941
C  -1.35341539 0.98759768 -1.7986057
C  -2.19417447 1.78615376 -2.60339647
H  -1.76641771 2.38919313 -3.42211004
C  -3.58027911 1.8230598 -2.36302413
H  -4.22599922 2.45098415 -2.99952566
C  -4.14127712 1.0746174 -1.31628003
H  -5.22732388 1.10895743 -1.12995393
C  -3.31012651 0.27726873 -0.50737328
H  -3.74231525 -0.31520866 0.31619736
C  -1.93127617 0.22728377 -0.75400709
H  -1.27993969 -0.40388819 -0.12172094
C  1.10219303 3.46424279 -3.23590326
H  1.24408254 4.01938107 -2.29513888
C  1.28297017 3.97775205 -4.56643866
H  1.58713601 5.00034612 -4.83015193
C  1.05683988 2.91047224 -5.50034362
H  1.15065526 2.97999554 -6.59325869
C  0.74655792 1.72622129 -4.75337142
H  0.55430493 0.72383962 -5.16415467
C  4.13291836 2.22539679 -2.94745445
H  4.11595577 2.42971291 -1.86877717
C  3.82572922 0.97035798 -3.57262437
H  3.50884454 0.0500531 -3.05765144
C  3.92465215 1.1418258 -4.99569443
H  3.71297603 0.37390257 -5.75304097
C  4.294688 2.50371285 -5.25372393
H  4.42745277 2.97117969 -6.24039522
C  6.4916424 4.81947082 -2.96220901
C  7.31184467 3.67329518 -3.05618428
H  6.96010089 2.78872809 -3.61402577
C  8.57525408 3.64774134 -2.43923749
H  9.20112069 2.74319434 -2.51944197
C  9.03735534 4.76064923 -1.71873104
H  10.0262155 4.73593432 -1.23210947
C  8.22956555 5.90834609 -1.62221349
H  8.58295167 6.78797834 -1.05863295
C  6.97264964 5.94005893 -2.24345862
H  6.34344187 6.84485126 -2.16324345
C  3.78224566 5.53951555 -2.47632259
C  2.78170208 6.48398562 -2.79226784
H  2.73039886 6.88529882 -3.81997094
C  1.85250347 6.90478686 -1.82386128
H  1.06898756 7.63286705 -2.09189265
C  1.93482378 6.40412481 -0.5145059
H  1.21120602 6.73096346 0.25130203
C  2.96286386 5.50500272 -0.17228811
H  3.05483607 5.14277646 0.86317031
C  3.87925895 5.07468441 -1.14297178
H  4.69493791 4.38572309 -0.85967663
