program: Gaussian 16
title: MeI + Xy rad
version: ES64L-G16RevC.01
method: UMN15L
basis: def2SVP
operation: Freq
keyword: #P
keyword: Geom=AllCheck
keyword: Guess=TCheck
keyword: SCRF=Check
keyword: GenChk
keyword: UMN15L/def2SVP
keyword: Freq
converged: YES YES NO NO
polarizability: 1.89538405e+02 -9.15039778e-03 1.37695663e+02 1.82271899e+00 1.70940244e-01 7.28019358e+01
1716.lowfreq: -4.4978 -1.1350 -0.0002 -0.0002 0.0003 7.3862 10.9656 12.8847 50.6522
frequency: 6.0459 12.6301 50.6421 54.7740 55.4011 72.1595 124.0644 126.3397 189.1292 219.8917 269.9180 388.8589 468.0712 504.2907 513.9263 521.7688 546.1827 691.7527 744.6353 775.0190 869.5403 869.8229 891.2529 921.2930 971.5929 980.0319 1002.4438 1035.2985 1040.7389 1054.9617 1111.4258 1176.0840 1251.6894 1255.2899 1290.3444 1385.2013 1388.4973 1389.3262 1426.5436 1444.4254 1444.5924 1452.7972 1453.7219 1461.8691 1484.2277 1500.6407 1609.8191 1684.1472 3029.9807 3030.6917 3070.4274 3131.5203 3131.5463 3158.9174 3159.1920 3162.7509 3168.5747 3200.0920 3225.1773 3225.5250
redmass: 3.6863 1.0328 3.3536 9.4306 3.8625 4.7302 1.0324 1.0225 3.2985 2.9098 2.5300 2.6540 3.8045 5.2038 3.0734 5.2144 5.1678 3.7750 5.5111 1.1922 1.1331 1.1334 1.3051 2.3237 2.0330 1.2809 2.9107 1.5174 1.5246 1.7672 1.5067 1.1574 1.1414 1.6323 2.6191 2.3114 1.7918 1.3198 2.2021 1.0605 1.0605 1.0416 1.0399 1.1210 1.4423 2.8204 5.3061 8.8528 1.0381 1.0382 1.0272 1.1021 1.1021 1.1043 1.1041 1.0869 1.0916 1.0971 1.1099 1.1099
irintensity: 0.3444 0.0040 1.2112 0.6396 1.4668 0.1118 0.0046 0.9772 6.4031 0.0010 2.3938 1.0997 0.7468 1.8721 0.0066 0.7494 0.0052 1.0113 0.1679 35.9829 5.2734 5.2047 0.0060 2.4737 5.1303 0.0057 0.0271 4.4341 0.0548 0.3619 3.0325 0.2663 70.8704 1.0585 0.1818 1.5390 0.9513 1.2024 3.7953 5.3375 5.4598 20.3229 0.0033 9.2019 23.8578 18.8114 0.9965 5.6816 39.4641 6.7982 16.3372 8.4779 3.7280 13.0623 14.1850 2.0618 15.6939 12.4472 0.3031 0.3444
temp: 298.150 k
press: 1.00000 atm
elementType: 6 6 6 6 6 6 1 1 1 6 1 1 1 6 1 1 1 53 6 1 1 1
symmnumber: 1
zpe: 471792.3 jmol-1
zpe.correction: 0.179696 hartree
zpe.thermalcorrener: 0.192885 hartree
zpe.thermalcorrenthalpy: 0.193829 hartree
zpe.thermalcorrgfe: 0.132719 hartree
zpe.sumelectzpe: -645.983898 hartree
zpe.sumelectthermal: -645.970709 hartree
zpe.sumelectthermalent: -645.969765 hartree
zpe.sumelectthermalfe: -646.030876 hartree
dipole: 0.8324 -0.0002 -0.0351
dipole: 0.8331
quadrupole: -72.6106 -78.7320 -88.0741
quadrupole: 0.7586 0.2156 -0.0075
quadrupole: 7.1950 1.0735 -8.2685 0.7586 0.2156 -0.0075
hfenergy: -646.1635944 hartree
pointgroup: C01 [X(C9H12I1)]
dipole: 0.3274871 -0.0000604 -0.0138099 debye
dipolederiv: -0.0126725 0.140696 0.0051343 -0.0351699 -0.0339088 0.0025714 0.0055776 0.0064101 -0.1363535 -0.1296107 -0.2583126 0.0030082 -0.0882581 0.2039144 -0.005633 -0.0090495 -0.001679 -0.0405206 0.0683418 -0.0000015 -0.002581 -0.0001016 -0.2151584 -0.0003073 0.0198103 -0.0003078 -0.0975793 -0.1295203 0.2583205 0.0043932 0.0883685 0.2037855 0.0069256 -0.0085791 0.0029664 -0.0404935 -0.0126809 -0.1407059 0.0043765 0.0351277 -0.0338484 -0.0020295 0.0057607 -0.0058791 -0.136396 0.0811364 -0.000027 0.0086083 -0.0000322 -0.0380929 0.0001772 0.0082911 0.0001881 -0.1087878 -0.0061375 -0.0597208 -0.0037356 -0.0643533 -0.0647649 -0.0028075 -0.0050923 -0.0027772 0.1137785 -0.0061193 0.0597215 -0.0034206 0.0643752 -0.0648049 0.0018674 -0.0047524 0.0018391 0.1138047 -0.0898886 0.0000354 -0.0089129 0.0000346 0.0582333 -0.0001752 -0.0092849 -0.0001751 0.1252665 0.0102513 -0.0894679 -0.0026781 -0.0288573 0.0918406 0.0000954 0.0032877 0.0077874 0.0741044 0.0296974 -0.0686149 -0.0685672 -0.0423751 -0.0030283 0.0311053 -0.1032881 -0.0232353 -0.0192788 0.0251312 -0.0745099 0.0666105 -0.0495611 -0.0048616 -0.0306079 0.1016278 0.0192886 -0.0156487 -0.040099 0.1281761 0.0005974 0.0243182 -0.0785208 -0.0029058 -0.0028056 -0.0017349 0.0806926 0.0102913 0.0894876 -0.0022048 0.0288938 0.0918382 -0.0000046 0.0034118 -0.0077126 0.0740323 0.0251447 0.0741325 0.0670122 0.0489995 -0.0049389 0.0306413 0.101894 -0.0192505 -0.0155948 0.029741 0.068968 -0.0682159 0.042896 -0.0029988 -0.0310032 -0.103046 0.0233496 -0.0193169 -0.0401195 -0.1281977 -0.0000763 -0.0243266 -0.0785146 0.0020729 -0.0029295 0.0009041 0.0807062 0.3482186 -0.0000178 0.0011876 0.000176 -0.1142551 0.0000584 -0.0007339 0.0000579 -0.1306464 0.325775 -0.0000274 -0.0038088 -0.0006432 -0.0314839 0.0000214 -0.0088544 0.0000102 -0.0231284 -0.1608859 0.0018868 0.039844 0.0012801 0.0842905 -0.0044142 0.0245813 -0.0042617 -0.0052593 -0.1629231 -0.0354226 -0.0166211 -0.0215556 0.0139744 -0.0371897 -0.0069673 -0.0356439 0.0671016 -0.1630713 0.0336016 -0.0199499 0.0207643 0.0213035 0.0415414 -0.0088592 0.0398555 0.0595172 unknown
polarizability: 189.5384054|-0.0091504|137.6956628|1.822719|0.1709402|72.8019358 unknown
InChI: InChI=1S/C8H9.CH3I/c1-7-4-3-5-8(2)6-7;1-2/h3-5H,1-2H3;1H3
charge 0 multiplicity 2
22 atoms
C  -4.30072449 -0.30993329 -0.09323735
C  -2.8851605 -0.33803268 -0.03206527
C  -2.28270113 0.91319254 -0.00219099
C  -2.88497668 2.16464645 -0.02547733
C  -4.30054585 2.13708699 -0.08679978
C  -4.99157113 0.91370586 -0.11976121
H  -4.85580839 -1.26486982 -0.11897383
H  -4.85548597 3.09222936 -0.10751505
H  -6.09291779 0.91390968 -0.16643259
C  -2.09501016 3.45398281 0.00878379
H  -1.44529006 3.50080522 0.90816479
H  -1.42314415 3.53334473 -0.87219357
H  -2.77054642 4.33250819 0.01536598
C  -2.09541031 -1.62766286 -0.00459231
H  -1.42356214 -1.70251373 -0.88597568
H  -1.44568053 -1.67933174 0.89451423
H  -2.77110155 -2.50609127 -0.00262279
I  0.9783201 0.91309657 -0.01776223
C  3.14651448 0.91286054 -0.03865934
H  3.48067876 0.86242609 -1.09043332
H  3.49559151 1.8459689 0.43871354
H  3.49623577 0.03013988 0.52608077
