program: Gaussian 16
title: benzene
version: ES64L-G16RevC.01
method: RMN15L
basis: def2SVP
operation: Freq
keyword: #P
keyword: Geom=AllCheck
keyword: Guess=TCheck
keyword: SCRF=Check
keyword: GenChk
keyword: RMN15L/def2SVP
keyword: Freq
converged: YES YES YES YES
title: Mulliken charges:
elementType: C C C C C C H H H H H H
charge: -0.036341 -0.036339 -0.036382 -0.036341 -0.036338 -0.036382 0.036353 0.036353 0.036356 0.036352 0.036353 0.036356
chargesum: 0.00000
title: Mulliken charges with hydrogens summed into heavy atoms:
elementType: C C C C C C
charge: 0.000012 0.000014 -0.000026 0.000012 0.000015 -0.000026
polarizability: 7.60219769e+01 1.12102817e-04 7.60001118e+01 1.50972202e-02 -3.06145441e-02 2.80072989e+01
1716.lowfreq: -9.1322 -0.0006 0.0001 0.0005 9.7130 41.0892 410.4446 410.5614 609.7978
frequency: 410.4446 410.5614 609.7971 609.9580 686.6885 727.8612 867.3212 867.8758 991.0369 991.3762 1016.4411 1020.1431 1028.7751 1070.8214 1071.5753 1160.7472 1192.2033 1192.4238 1365.4076 1405.1928 1517.3655 1518.0661 1668.4571 1669.3275 3174.0660 3185.3640 3185.4270 3200.8341 3200.8580 3210.0531
redmass: 2.9045 2.9026 5.8973 5.8995 1.0848 4.0612 1.2493 1.2493 1.3679 1.3675 6.5876 1.2058 5.9390 1.6052 1.6022 1.0382 1.1183 1.1179 1.2493 8.8956 2.1579 2.1630 5.9378 5.9473 1.0825 1.0882 1.0882 1.0978 1.0977 1.1023
irintensity: 0.0000 0.0000 0.0000 0.0000 97.4878 0.0000 0.0000 0.0000 0.0001 0.0000 0.0001 0.0000 0.0000 3.9250 3.9122 0.0002 0.0000 0.0000 0.0000 0.0002 8.8277 8.6575 0.0000 0.0000 0.0005 0.0000 0.0000 23.6842 23.9151 0.0000
temp: 298.150 k
press: 1.00000 atm
elementType: 6 6 6 6 6 6 1 1 1 1 1 1
symmnumber: 1
zpe: 264533.0 jmol-1
zpe.correction: 0.100755 hartree
zpe.thermalcorrener: 0.105155 hartree
zpe.thermalcorrenthalpy: 0.106100 hartree
zpe.thermalcorrgfe: 0.073263 hartree
zpe.sumelectzpe: -231.727284 hartree
zpe.sumelectthermal: -231.722884 hartree
zpe.sumelectthermalent: -231.721940 hartree
zpe.sumelectthermalfe: -231.754776 hartree
dipole: 0.0000 -0.0000 0.0001
dipole: 0.0001
quadrupole: -32.8099 -32.8093 -40.6219
quadrupole: 0.0001 0.0025 -0.0050
quadrupole: 2.6038 2.6044 -5.2082 0.0001 0.0025 -0.0050
hfenergy: -231.8280394 hartree
pointgroup: C01 [X(C6H6)]
dipole: 0.0000004 -0.0000007 0.0000306 debye
dipolederiv: -0.036028 0.0821497 -0.0000331 0.0811151 0.0580307 -0.0000892 -0.0000262 -0.0000753 -0.1244926 -0.0360468 -0.082148 0.0000802 -0.0811101 0.0580579 -0.0001377 0.0001045 -0.0001903 -0.1244925 0.1042767 -0.0000039 0.0000946 -0.0000048 -0.0835944 -0.0000221 0.0000578 -0.0000213 -0.1244594 -0.0360261 0.082156 -0.000024 0.0811119 0.0580274 -0.0000854 -0.0000135 -0.0000651 -0.1244927 -0.0360445 -0.0821537 0.0000899 -0.0811066 0.0580557 -0.0001604 0.0000768 -0.000148 -0.1244924 0.1042767 -0.0000021 0.0000508 -0.0000134 -0.0835943 -0.0000251 0.0000775 -0.0000243 -0.1244595 0.0257203 -0.0640272 0.0000125 -0.0638427 -0.047682 0.0000898 0.0000172 0.0000825 0.1244864 0.0257323 0.0640221 -0.0000705 0.0638399 -0.047703 0.0001246 -0.0000928 0.0001608 0.124485 -0.083636 0.0000037 -0.000075 -0.0000147 0.0628729 0.000038 -0.0000586 0.0000345 0.1244732 0.0256992 -0.0640584 0.0000071 -0.063836 -0.0476611 0.0000908 -0.0000024 0.0000781 0.1244863 0.0257118 0.0640524 -0.0000741 0.0638335 -0.0476827 0.0001361 -0.0000644 0.0001271 0.124485 -0.0836357 0.0000093 -0.0000582 0.0000278 0.062873 0.0000405 -0.0000759 0.0000415 0.1244733 unknown
polarizability: 76.0219769|0.0001121|76.0001118|0.0150972|-0.0306145|28.0072989 unknown
InChI: InChI=1S/C6H6/c1-2-4-6-5-3-1/h1-6H
charge 0 multiplicity 1
12 atoms
C  -1.26898269 -0.58636945 0.00005712
C  0.13669172 -0.58643125 0.00044956
C  0.8395291 0.63087428 -0.00002607
C  0.13676678 1.84833286 -0.00106596
C  -1.26882028 1.8483949 -0.00152696
C  -1.97170172 0.63101508 -0.00090834
H  -1.82033532 -1.54126777 0.00049612
H  0.68793906 -1.54139392 0.00128677
H  1.94217202 0.63089873 0.00035291
H  0.68825329 2.80315354 -0.00146296
H  -1.8201971 2.80328278 -0.00232702
H  -3.07434477 0.63114051 -0.00123617
