program: Gaussian 09
title: 000048220
version: EM64L-G09RevD.01
frameworkgroup: C1[X(C12H21NOS)]
method: RPBEPBE
basis: SDD
operation: Freq
keyword: #p
keyword: freq=noraman
keyword: PBEPBE/SDD
title: #p freq=noraman PBEPBE/SDD
converged: NO YES NO NO
title: Mulliken charges:
elementType: S O N C C C C C C C C C C C C H H H H H H H H H H H H H H H H H H H H H
charge: 0.119583 -0.272777 -0.351889 -0.220035 -0.398233 -0.371188 0.256325 -0.708756 -0.704407 -0.708645 -0.453249 -0.013245 -0.018520 -0.550641 -0.556893 0.259693 0.222743 0.234571 0.218453 0.218842 0.216556 0.229713 0.224186 0.212524 0.249970 0.311086 0.271574 0.279404 0.224458 0.251015 0.226793 0.209832 0.221364 0.222524 0.217034 0.230234
chargesum: 0.00000
title: Mulliken charges with hydrogens summed into heavy atoms:
elementType: S O N C C C C C C C C C C C C
charge: 0.119583 -0.272777 -0.040803 -0.220035 0.084203 0.081836 0.256325 -0.043645 -0.017727 -0.157667 0.022224 0.213547 0.191312 -0.106753 -0.109624
polarizability: 1.94067199e+02 -1.20869531e+01 1.52185244e+02 -2.82208342e+00 -6.67145606e+00 1.29191792e+02
1716.lowfreq: -15.3079 -12.5716 -5.4430 -0.0021 -0.0021 -0.0013 11.9197 15.7435 32.9091
frequency: -9.9936 10.5200 32.7387 41.7892 51.9202 84.4082 99.1754 102.0565 114.4185 134.0312 147.0228 183.7238 209.7073 218.4213 245.5759 255.0686 282.7312 312.0936 321.7093 333.6966 359.5603 396.5214 397.7933 406.0819 423.6547 554.9703 567.7502 657.0139 672.3028 697.2449 717.3116 725.1361 764.3522 795.1292 833.4135 881.0896 891.3333 917.5608 930.2476 938.6315 949.5770 955.2512 964.7226 999.4075 1005.0637 1020.9629 1046.8087 1053.8252 1072.9948 1083.6294 1109.7574 1145.0796 1152.1040 1174.3382 1199.9619 1209.0768 1236.8632 1254.8649 1259.4728 1281.2243 1290.9607 1292.1564 1324.7969 1337.8164 1340.7437 1387.2172 1398.4734 1419.4588 1426.9371 1450.2749 1453.8931 1463.8742 1470.5234 1479.2722 1480.8340 1486.9712 1492.0712 1497.1164 1591.4232 1652.0213 1658.3007 2978.9094 2984.0456 2988.9377 2992.6129 3001.8613 3011.4943 3042.6001 3047.3832 3069.3900 3075.5070 3078.0847 3081.7871 3084.0676 3084.1637 3088.9680 3093.7464 3098.6724 3110.2253 3198.5740 3200.0856 3426.6921
redmass: 3.2897 2.8961 3.6807 5.4893 3.9904 2.5962 2.3341 2.5140 3.0384 2.1240 3.1011 1.8291 2.9677 1.1185 2.8301 3.4478 2.0925 3.5974 2.4928 3.3860 2.3066 3.9111 2.9820 3.0907 2.5508 2.6624 2.1478 1.6731 2.6010 1.4270 2.8595 2.3849 1.8361 1.3641 1.9538 1.3828 2.2602 1.9196 1.7713 1.8711 1.3453 1.6235 1.5244 1.1510 1.1118 1.8255 2.2094 3.3502 2.3254 1.3785 1.9348 2.0883 2.0384 3.0498 1.5303 2.1936 1.1920 1.2022 1.1833 1.1998 1.2367 1.2308 1.3562 1.2460 1.4798 1.2152 1.1961 1.1488 1.1685 1.1567 1.1186 1.0565 1.0504 1.0914 1.0729 1.1485 1.4310 1.0762 7.9513 4.6058 4.6372 1.0359 1.0650 1.0369 1.0587 1.0629 1.0564 1.1013 1.0974 1.0890 1.0990 1.1000 1.0994 1.0906 1.0780 1.0731 1.1005 1.0839 1.0967 1.1151 1.1148 1.0778
irintensity: 0.1896 0.1306 0.0911 4.6035 0.5301 0.6048 0.0849 0.6987 0.8753 1.1354 3.2438 2.1900 1.8694 0.0936 1.0501 0.8906 1.2016 12.6995 0.8878 3.3220 5.5352 1.1929 3.3529 1.0137 1.8245 3.1435 4.0026 22.1976 11.0558 100.2167 0.7099 18.9879 7.6151 17.8789 22.9701 5.9669 5.7725 4.6559 10.9420 3.4712 61.6505 36.9314 57.3973 30.0645 9.3209 7.7753 1.0115 2.5972 1.6935 9.7429 21.9530 29.2779 0.4607 10.6574 1.4500 35.4975 4.4154 34.9669 4.5553 0.2050 1.0286 0.2242 5.0462 1.0279 0.1851 26.7200 17.4389 5.5417 7.9677 16.2564 27.8495 8.8186 8.4700 21.7027 27.4083 53.2213 124.3555 12.1411 146.6561 9.4974 5.9463 37.5900 44.6878 35.2692 18.9307 6.9578 16.2773 13.4117 2.7790 5.1378 47.2523 40.8738 26.4496 4.0612 14.9624 10.1020 35.0488 7.5085 15.2734 22.0971 26.7323 69.6579
temp: 298.150 k
press: 1.00000 atm
elementType: 16 8 7 6 6 6 6 6 6 6 6 6 6 6 6 1 1 1 1 1 1 1 1 1 1 1 1 1 1 1 1 1 1 1 1 1
symmnumber: 1
zpe: 801592.7 jmol-1
zpe.correction: 0.305311 hartree
zpe.thermalcorrener: 0.323803 hartree
zpe.thermalcorrenthalpy: 0.324747 hartree
zpe.thermalcorrgfe: 0.256534 hartree
zpe.sumelectzpe: -996.680122 hartree
zpe.sumelectthermal: -996.661630 hartree
zpe.sumelectthermalent: -996.660686 hartree
zpe.sumelectthermalfe: -996.728899 hartree
dipole: -1.2034 1.2966 -1.3686
dipole: 2.2366
quadrupole: -92.5277 -102.9382 -102.0513
quadrupole: -0.6417 0.3717 5.9652
quadrupole: 6.6447 -3.7657 -2.8789 -0.6417 0.3717 5.9652
hfenergy: -996.9854328 hartree
pointgroup: C01 [X(C12H21N1O1S1)]
dipole: -0.4097225 0.5072809 -0.5908533 debye
polarizability: 190.54951|-17.0503421|154.1901089|-2.0585839|-8.7399435|130.7046159 unknown
InChI: InChI=1S/C12H21NOS/c1-5-9-13-11(14)12(7-3,8-4)15-10-6-2/h5-6,13H,1-2,7-10H2,3-4H3
charge 0 multiplicity 1
36 atoms
S  0.895669 1.388366 -1.093643
O  0.273257 -1.851158 1.255792
N  -0.765585 -1.10042 -0.689658
C  1.479283 -0.182104 -0.106262
C  2.198909 0.226608 1.202633
C  2.407524 -0.920423 -1.125097
C  0.264122 -1.099994 0.229047
C  3.496337 1.036077 1.012473
C  3.037276 -2.220638 -0.57593
C  -0.264994 2.210185 0.196878
C  -1.973303 -1.931334 -0.519106
C  -1.128971 3.232248 -0.490562
C  -3.192664 -1.108954 -0.130312
C  -2.483229 3.161677 -0.555877
C  -3.844004 -1.226051 1.053068
H  2.398592 -0.703747 1.765354
H  1.490522 0.795904 1.834186
H  3.207314 -0.221502 -1.434838
H  1.81932 -1.15239 -2.034145
H  4.287145 0.438545 0.523674
H  3.88757 1.361281 1.993623
H  3.319883 1.935812 0.394802
H  3.706473 -2.019724 0.279457
H  3.637122 -2.707526 -1.366229
H  2.266648 -2.933827 -0.236163
H  -0.719299 -0.389113 -1.431526
H  0.385916 2.675504 0.956617
H  -0.871509 1.414194 0.660677
H  -2.167411 -2.475378 -1.464778
H  -1.741198 -2.670209 0.266514
H  -0.606835 4.082901 -0.952332
H  -3.548023 -0.382546 -0.878325
H  -3.073228 3.93982 -1.052601
H  -3.035876 2.328529 -0.10356
H  -4.724165 -0.61655 1.289156
H  -3.512188 -1.936363 1.819894
