program: Gaussian 09
title: 000048205
version: EM64L-G09RevD.01
frameworkgroup: C1[X(C10H17NOS)]
method: RPBEPBE
basis: SDD
operation: Freq
keyword: #p
keyword: freq=noraman
keyword: PBEPBE/SDD
title: #p freq=noraman PBEPBE/SDD
converged: YES YES NO NO
title: Mulliken charges:
elementType: S O N C C C C C C C C C C H H H H H H H H H H H H H H H H H
charge: 0.145967 -0.272692 -0.364056 -0.217411 -0.371128 -0.398792 0.249092 -0.702875 -0.705388 -0.725365 -0.615149 0.240672 -0.461768 0.235435 0.218800 0.263200 0.219226 0.251918 0.213682 0.223926 0.219696 0.217936 0.230337 0.317796 0.292583 0.288874 0.228395 0.226781 0.272957 0.277352
chargesum: 0.00000
title: Mulliken charges with hydrogens summed into heavy atoms:
elementType: S O N C C C C C C C C C C
charge: 0.145967 -0.272692 -0.046260 -0.217411 0.083106 0.083635 0.249092 -0.013350 -0.037419 -0.143909 0.112984 0.240672 -0.184416
polarizability: 1.78517338e+02 6.03214719e+00 1.24419287e+02 -7.65172867e+00 -3.21893971e+00 1.06741993e+02
1716.lowfreq: -16.4832 -10.1844 -6.8349 0.0009 0.0016 0.0022 26.1533 43.4598 70.2848
frequency: 25.6357 43.4054 70.2268 82.3343 90.4336 103.4048 111.9550 132.4052 159.5428 187.5936 197.9740 209.2075 222.0633 270.0795 284.1730 314.9782 322.0146 323.9176 349.1298 373.7967 408.0079 440.1019 557.2433 638.7686 648.9459 670.8337 681.5138 701.2877 715.6383 765.1119 792.0774 835.0569 878.6799 889.5001 928.9536 968.0027 1019.3121 1043.5813 1053.4210 1074.6481 1108.5234 1120.2629 1141.2003 1152.6773 1162.2905 1173.3957 1216.7049 1236.9073 1258.4103 1280.2649 1321.1008 1340.2368 1389.1946 1394.7564 1415.5312 1444.5647 1456.5342 1462.9890 1468.1825 1477.1887 1480.9103 1485.5540 1486.9320 1494.4375 1512.9285 1597.3315 2143.6104 2978.0528 2981.7577 2988.5067 2990.9216 3001.0557 3010.2424 3041.3217 3046.6291 3057.5181 3077.4108 3079.5056 3080.1725 3082.8592 3095.8266 3106.3846 3426.7318 3450.5377
redmass: 4.4738 4.5935 4.0734 1.3383 1.7192 2.3342 2.2049 2.8263 2.4614 3.9920 2.2529 1.8307 1.8150 2.8835 2.2511 2.6751 3.0573 3.4684 3.9355 4.9874 4.4369 9.9412 2.8945 1.2318 1.5707 2.9500 2.9097 1.4357 2.2350 1.7834 1.4281 2.0618 1.4728 2.4866 1.7540 4.1973 1.8143 2.1299 3.1383 2.3742 1.9114 1.3075 1.7617 2.0617 1.1074 2.9805 2.0866 1.2078 1.1852 1.2068 1.3565 1.4796 1.2145 1.1963 1.1913 1.1097 1.2550 1.0671 1.0551 1.0664 1.0517 1.0459 1.0434 1.0657 1.4486 7.6769 6.0458 1.0346 1.0360 1.0506 1.0447 1.0627 1.0566 1.1014 1.0971 1.1022 1.0991 1.1057 1.1000 1.0994 1.1005 1.0987 1.1589 1.0777
irintensity: 0.0855 6.6678 0.6531 0.0937 0.4360 0.0689 1.5399 0.2138 2.6081 3.8756 3.6714 1.0555 1.1919 2.4852 2.8014 2.9887 17.9742 3.5235 0.6047 4.0003 6.3565 2.3138 4.3573 72.8722 35.9835 42.5953 42.2168 59.3718 2.7856 6.0911 12.1763 23.0076 1.3252 8.3328 11.0601 5.0767 3.6606 5.3820 2.1944 3.6837 26.3312 1.1719 50.7163 1.2010 1.5486 9.2401 23.2928 11.0816 2.7639 0.2438 5.0766 0.2617 22.8317 19.4788 23.8961 12.9613 77.2956 6.3291 25.7075 19.8128 10.5876 15.3126 1.0411 2.4689 108.8631 164.9585 2.2725 76.6389 27.3260 25.1012 26.7743 9.2505 11.5045 12.8787 4.0971 31.4048 39.5873 5.9460 49.3731 22.0448 30.4787 2.8748 77.7091 61.0104
temp: 298.150 k
press: 1.00000 atm
elementType: 16 8 7 6 6 6 6 6 6 6 6 6 6 1 1 1 1 1 1 1 1 1 1 1 1 1 1 1 1 1
symmnumber: 1
zpe: 653777.2 jmol-1
zpe.correction: 0.249011 hartree
zpe.thermalcorrener: 0.265983 hartree
zpe.thermalcorrenthalpy: 0.266927 hartree
zpe.thermalcorrgfe: 0.203816 hartree
zpe.sumelectzpe: -918.212435 hartree
zpe.sumelectthermal: -918.195462 hartree
zpe.sumelectthermalent: -918.194518 hartree
zpe.sumelectthermalfe: -918.257629 hartree
dipole: 1.1518 0.4086 -1.3527
dipole: 1.8231
quadrupole: -84.4643 -82.9455 -90.7576
quadrupole: 5.9542 5.1359 -6.3424
quadrupole: 1.5915 3.1103 -4.7018 5.9542 5.1359 -6.3424
hfenergy: -918.4614453 hartree
pointgroup: C01 [X(C10H17N1O1S1)]
dipole: -0.3675931 0.2592862 0.5586504 debye
polarizability: 171.5968022|-17.3695948|130.1353165|-10.9307818|6.2276478|107.9464997 unknown
InChI: InChI=1S/C10H17NOS/c1-5-8-13-10(6-2,7-3)9(12)11-4/h1,11H,6-8H2,2-4H3
charge 0 multiplicity 1
30 atoms
S  -0.949941 -0.595924 1.056094
O  1.854389 0.961366 -1.432815
N  0.652393 1.876299 0.340225
C  0.753854 -0.609299 0.118062
C  1.768219 -1.002192 1.242462
C  0.720207 -1.609932 -1.064116
C  1.114957 0.813707 -0.407789
C  3.229573 -1.128861 0.755397
C  0.494947 -3.083049 -0.673364
C  -2.117622 -0.066992 -0.372027
C  1.00008 3.267559 0.034431
C  -3.381927 0.430823 0.16298
C  -4.455855 0.84607 0.604944
H  1.440845 -1.961165 1.68672
H  1.712932 -0.243043 2.046844
H  1.673616 -1.493736 -1.61123
H  -0.059313 -1.288074 -1.781594
H  3.579217 -0.201002 0.271243
H  3.890872 -1.344177 1.614202
H  3.346105 -1.950384 0.026612
H  1.33865 -3.48618 -0.084427
H  0.399846 -3.705433 -1.581649
H  -0.425762 -3.204114 -0.073666
H  0.012035 1.65516 1.112474
H  -1.591789 0.71774 -0.944242
H  -2.280031 -0.943886 -1.020126
H  1.561678 3.730907 0.866923
H  0.095506 3.871719 -0.163151
H  1.634307 3.264973 -0.866801
H  -5.392791 1.206521 0.988988
