program: Gaussian 09
title: 000048200
version: EM64L-G09RevD.01
frameworkgroup: C1[X(C14H27NOS)]
method: RPBEPBE
basis: SDD
operation: Freq
keyword: #p
keyword: freq=noraman
keyword: PBEPBE/SDD
title: #p freq=noraman PBEPBE/SDD
converged: YES YES NO NO
title: Mulliken charges:
elementType: S O N C C C C C C C C C C C C C C H H H H H H H H H H H H H H H H H H H H H H H H H H H
charge: 0.113309 -0.273072 -0.384571 -0.038721 -0.443691 -0.424924 -0.412943 -0.401589 -0.378940 -0.228787 0.231835 -0.394530 -0.373261 -0.710187 -0.706822 -0.591354 -0.655593 0.248845 0.214513 0.198395 0.194926 0.236366 0.207870 0.190631 0.199998 0.203449 0.192893 0.201813 0.309427 0.257918 0.220717 0.233369 0.214429 0.229683 0.215069 0.218282 0.223772 0.211269 0.250029 0.263026 0.264528 0.221447 0.229670 0.221507
chargesum: 0.00000
title: Mulliken charges with hydrogens summed into heavy atoms:
elementType: S O N C C C C C C C C C C C C C C
charge: 0.113309 -0.273072 -0.075144 0.210123 -0.030783 0.006368 -0.014442 0.001858 0.015766 -0.228787 0.231835 0.084105 0.074538 -0.047152 -0.021752 -0.063800 0.017031
polarizability: 1.95920613e+02 -8.77273267e+00 1.81208835e+02 3.11584641e+00 4.05930750e-01 1.51318127e+02
1716.lowfreq: -39.2797 -11.0348 -9.6453 -0.0013 -0.0011 0.0003 8.7946 37.6534 43.5739
frequency: -33.2874 37.3427 43.0137 54.5097 71.8883 86.2206 96.7260 109.1645 128.2506 153.2926 157.2370 190.0528 210.3736 216.6441 233.5895 238.1692 266.3592 270.8253 283.1574 299.2640 324.9984 333.4452 368.2723 394.6375 412.1375 422.6282 461.5792 479.3643 554.0994 627.5289 631.9205 659.6757 684.1149 719.4528 756.0773 771.9389 785.0360 791.0680 809.5473 825.4322 838.8342 861.9893 874.8845 918.7483 927.7866 933.1640 992.1528 994.9306 1012.3306 1024.8873 1033.3218 1045.4440 1048.3968 1052.7913 1062.3606 1072.8942 1087.0517 1109.2976 1112.4743 1141.7790 1151.4307 1158.6066 1175.8935 1206.6205 1240.1344 1241.7575 1257.3141 1261.2946 1268.7922 1270.2782 1279.7432 1300.5979 1320.4640 1325.5394 1328.5177 1332.8135 1340.7336 1347.4482 1351.5408 1367.6926 1387.6217 1394.2215 1396.5485 1449.9474 1456.6686 1459.8324 1460.6140 1462.7771 1465.6810 1469.7016 1470.4539 1471.8788 1478.6930 1481.5494 1481.8886 1485.4037 1489.0060 1495.2453 1585.0052 2956.9148 2965.8338 2967.4895 2977.1045 2979.6982 2981.5642 2982.9826 2988.5362 2991.0867 3001.5249 3016.8490 3021.4300 3027.4097 3030.1115 3036.7237 3041.8048 3043.9229 3045.7565 3052.1926 3073.6567 3075.4499 3077.7257 3078.3867 3081.8621 3093.7216 3100.8952 3443.3589
redmass: 3.3321 3.0093 4.4511 4.0810 3.4070 2.8436 2.3455 2.2715 2.1842 2.3526 3.0976 2.0548 2.4103 1.1063 2.6748 1.3908 2.6160 2.7562 3.0743 1.9523 2.6938 2.4614 2.7505 2.8298 4.2105 3.8980 2.1671 2.5944 2.7700 3.8707 2.8006 1.1211 3.4813 3.1016 2.1428 1.5011 1.1520 1.4847 2.1047 1.8601 1.9013 2.4145 2.3293 1.5643 1.7348 2.1216 2.1604 1.7991 2.7402 1.7608 1.2240 1.4416 2.1920 1.8240 2.2701 2.1645 1.7248 1.7732 1.0985 2.1178 1.9452 2.0705 3.1260 1.9093 1.2294 1.3483 1.2703 1.1853 1.2719 1.2840 1.1971 1.6879 1.3911 1.3722 1.4299 1.4350 1.4735 1.4316 1.4707 1.3386 1.2159 1.2051 1.1966 1.1164 1.2208 1.0914 1.1063 1.0878 1.2599 1.0514 1.0589 1.0904 1.0560 1.0682 1.0488 1.0523 1.2133 1.0671 8.3088 1.0668 1.0658 1.0596 1.0633 1.0360 1.0622 1.0353 1.0410 1.0546 1.0626 1.0574 1.0856 1.0956 1.0945 1.1010 1.1013 1.1018 1.0979 1.1005 1.1025 1.0989 1.0987 1.1000 1.0993 1.1004 1.1059 1.0772
irintensity: 0.0634 0.5235 2.7973 1.3273 0.6438 0.9745 0.8274 1.1101 0.9764 1.0985 2.9884 0.7247 0.4744 0.1715 2.2016 1.6440 10.7805 1.1651 3.0670 0.8618 1.4063 3.2142 0.9770 0.9628 0.9725 6.4089 0.2240 0.3920 2.4077 4.2110 7.0303 64.5370 4.2242 3.0390 2.9887 0.6517 4.7129 19.1207 13.2068 9.4000 3.0204 6.4466 15.7037 9.7586 7.1161 6.9199 0.7493 15.3218 5.2586 6.8009 0.3821 0.4714 1.3089 0.7515 5.9311 1.3631 0.4712 13.7296 3.9111 2.5655 6.3881 6.4063 7.6388 8.7206 1.1679 10.0410 2.6232 5.5432 10.1646 10.5713 5.5275 3.8508 5.7835 0.1003 1.2635 1.1758 0.6055 0.5475 1.2987 2.9784 26.7757 21.4467 15.5600 39.5575 66.8478 2.2354 22.7712 47.4859 101.0660 28.4849 12.8378 40.3482 7.6129 16.3006 8.9595 6.3470 87.1214 6.1317 160.3609 23.9734 24.1041 48.7023 20.0984 38.0191 27.2913 33.0388 30.6212 20.7620 6.4252 16.0910 36.5604 74.3090 52.3660 43.3332 19.8622 48.8078 3.8366 73.8876 5.8810 36.4661 27.4594 48.5300 24.0051 34.8035 52.5832 46.2811
temp: 298.150 k
press: 1.00000 atm
elementType: 16 8 7 6 6 6 6 6 6 6 6 6 6 6 6 6 6 1 1 1 1 1 1 1 1 1 1 1 1 1 1 1 1 1 1 1 1 1 1 1 1 1 1 1
symmnumber: 1
zpe: 1020465.4 jmol-1
zpe.correction: 0.388675 hartree
zpe.thermalcorrener: 0.408403 hartree
zpe.thermalcorrenthalpy: 0.409348 hartree
zpe.thermalcorrgfe: 0.340792 hartree
zpe.sumelectzpe: -1076.363225 hartree
zpe.sumelectthermal: -1076.343497 hartree
zpe.sumelectthermalent: -1076.342552 hartree
zpe.sumelectthermalfe: -1076.411108 hartree
dipole: -1.7471 1.5080 -1.3807
dipole: 2.6894
quadrupole: -107.6196 -112.7466 -119.9416
quadrupole: 1.1019 0.0651 8.2868
quadrupole: 5.8163 0.6893 -6.5056 1.1019 0.0651 8.2868
hfenergy: -1076.7518998 hartree
pointgroup: C01 [X(C14H27N1O1S1)]
dipole: -0.6232096 0.5614399 -0.6449255 debye
polarizability: 193.2254465|-10.1595225|182.7879643|2.8598554|-6.5534516|152.4341637 unknown
InChI: InChI=1S/C14H27NOS/c1-4-14(5-2,17-6-3)13(16)15-12-10-8-7-9-11-12/h12,15H,4-11H2,1-3H3
charge 0 multiplicity 1
44 atoms
S  1.573854 0.885701 -1.436106
O  0.618781 -1.23858 1.873099
N  -0.641119 -0.592083 0.029514
C  -1.950239 -0.901181 0.645595
C  -2.9763 -1.26703 -0.456303
C  -2.471908 0.279357 1.512924
C  -3.388986 -0.043868 -1.313869
C  -2.880339 1.501071 0.657225
C  -3.915433 1.110416 -0.426798
C  1.844924 -0.558701 -0.163922
C  0.553821 -0.797838 0.679157
C  3.032312 -0.243315 0.77848
C  2.087073 -1.804364 -1.077653
C  4.401505 -0.095273 0.087445
C  2.356686 -3.112143 -0.299767
C  1.284359 2.360081 -0.272285
C  0.659077 3.518427 -1.063639
H  -1.778915 -1.768783 1.309897
H  -2.568727 -2.074628 -1.09421
H  -3.879284 -1.671197 0.042847
H  -3.352623 -0.079424 2.084001
H  -1.695922 0.549808 2.252196
H  -4.160924 -0.348384 -2.046202
H  -2.525461 0.318272 -1.911301
H  -1.980001 1.925263 0.16576
H  -3.288859 2.297437 1.308531
H  -4.854565 0.786467 0.068095
H  -4.168864 1.988591 -1.05165
H  -0.593141 -0.15734 -0.900035
H  3.064509 -1.046811 1.537015
H  2.797838 0.67623 1.347966
H  2.941469 -1.584307 -1.744945
H  1.201778 -1.939835 -1.728891
H  4.369786 0.675172 -0.704534
H  5.168872 0.198935 0.826478
H  4.734825 -1.042162 -0.374968
H  3.293455 -3.053166 0.282224
H  2.451674 -3.956505 -1.006485
H  1.539776 -3.340455 0.406439
H  2.256387 2.649133 0.159801
H  0.61587 2.01878 0.537277
H  -0.325697 3.235851 -1.476942
H  1.306443 3.829605 -1.903086
H  0.516629 4.393778 -0.402978
