program: Gaussian 09
title: 000048196
version: EM64L-G09RevD.01
frameworkgroup: C1[X(C10H19NOS)]
method: RPBEPBE
basis: SDD
operation: Freq
keyword: #p
keyword: freq=noraman
keyword: PBEPBE/SDD
title: #p freq=noraman PBEPBE/SDD
converged: YES YES NO NO
title: Mulliken charges:
elementType: S O N C C C C C C C C C C H H H H H H H H H H H H H H H H H H H
charge: 0.121135 -0.261553 -0.606962 -0.188029 -0.369931 -0.401182 0.225658 -0.705609 -0.707075 -0.708264 -0.125127 -0.144037 -0.726811 0.234697 0.219601 0.259053 0.209743 0.213115 0.249999 0.224163 0.216152 0.231250 0.218313 0.264887 0.268183 0.327332 0.327450 0.239058 0.216992 0.225992 0.226128 0.225682
chargesum: 0.00000
title: Mulliken charges with hydrogens summed into heavy atoms:
elementType: S O N C C C C C C C C C C
charge: 0.121135 -0.261553 0.047820 -0.188029 0.084367 0.067614 0.225658 -0.018332 -0.041360 -0.175194 0.113931 0.072954 -0.049010
polarizability: 1.92950927e+02 -9.32836578e+00 1.24811228e+02 -4.51138027e+00 7.10599978e-01 1.09832064e+02
1716.lowfreq: -13.5655 -5.3403 0.0010 0.0021 0.0026 8.4545 17.5205 41.2090 49.2862
frequency: 17.4750 40.9547 49.2552 86.1863 93.1672 107.8088 127.0534 148.1273 159.8448 196.7599 197.6714 219.5599 246.5232 253.5982 272.8559 295.5730 306.8726 332.7876 367.5101 394.7492 410.1164 501.8490 529.7696 577.4514 614.8123 637.4145 659.2942 716.3071 727.5036 788.2537 796.1346 825.2668 870.7085 906.6865 930.9792 934.3510 977.9193 1021.6373 1044.3522 1047.2974 1061.8504 1076.0639 1084.4940 1093.0920 1108.5887 1145.4824 1171.1053 1173.1351 1229.0339 1258.0832 1270.2427 1294.5560 1303.6414 1308.9595 1333.9062 1343.7167 1389.3889 1394.8083 1394.8754 1455.3261 1460.8762 1462.0577 1467.6177 1470.3934 1477.3676 1481.9919 1487.4243 1496.0309 1552.2625 1618.8357 1683.7977 2967.5728 2981.9460 2988.4568 2992.2170 3002.0780 3015.5342 3041.8469 3042.4761 3045.2838 3072.2634 3076.8593 3080.5140 3082.4239 3086.5867 3092.3485 3092.9726 3108.6403 3457.5717 3641.1204
redmass: 3.4990 3.1016 4.3418 3.0063 2.3579 2.4007 2.0574 2.5007 2.1077 1.4181 2.1324 1.2547 4.3099 2.5922 2.2885 2.6548 2.2110 2.8189 3.6710 4.3130 4.6880 2.7372 2.4001 1.4458 2.7174 3.3271 1.2381 2.5565 1.9682 1.2998 1.5811 1.8630 1.7837 2.3143 1.3877 1.7789 1.0809 1.7748 1.5475 2.2844 1.9241 2.0892 1.3427 3.5857 1.9531 2.0068 1.9976 2.1890 1.1927 1.1818 1.2620 1.2552 1.3383 1.5187 1.7248 1.8628 1.2139 1.2239 1.2079 1.1072 1.0473 1.0591 1.0572 1.0592 1.0650 1.0517 1.0449 1.0637 1.4166 4.2490 5.9791 1.0367 1.0358 1.0367 1.0586 1.0626 1.0558 1.0969 1.1014 1.0976 1.0933 1.0990 1.0997 1.0995 1.1023 1.0989 1.1005 1.0936 1.0477 1.1010
irintensity: 0.1077 3.6484 2.0049 1.8196 0.7012 0.8572 0.2464 0.2941 0.8079 1.7746 1.8128 0.9358 6.4707 7.7718 1.7754 2.3111 0.7568 1.7174 1.5963 4.0092 4.3414 1.0538 6.1695 125.8870 58.3242 38.4933 41.5343 3.5028 11.3376 11.5402 5.9430 26.8865 0.3323 4.5667 21.2057 10.7552 58.1538 5.1359 0.3434 1.0102 4.3129 6.4409 3.3273 0.7108 26.9010 5.7682 3.8866 4.4141 9.6353 5.1240 17.4892 1.7194 4.6671 25.6097 24.8203 19.4790 23.1817 17.7685 8.8645 5.7014 15.1082 2.0828 21.4927 21.7023 19.5438 9.1290 0.1445 4.2925 110.1640 252.4260 8.5945 39.7706 34.4415 34.4850 18.0898 10.0850 18.4154 24.7486 10.8601 6.7320 2.9662 52.7433 38.5795 27.7286 7.2562 27.0904 30.8814 43.8118 33.4052 57.2396
temp: 298.150 k
press: 1.00000 atm
elementType: 16 8 7 6 6 6 6 6 6 6 6 6 6 1 1 1 1 1 1 1 1 1 1 1 1 1 1 1 1 1 1 1
symmnumber: 1
zpe: 716863.1 jmol-1
zpe.correction: 0.273039 hartree
zpe.thermalcorrener: 0.290088 hartree
zpe.thermalcorrenthalpy: 0.291033 hartree
zpe.thermalcorrgfe: 0.227297 hartree
zpe.sumelectzpe: -919.447604 hartree
zpe.sumelectthermal: -919.430554 hartree
zpe.sumelectthermalent: -919.429610 hartree
zpe.sumelectthermalfe: -919.493346 hartree
dipole: 2.5138 -0.2287 -1.5730
dipole: 2.9742
quadrupole: -84.0254 -83.2556 -93.9464
quadrupole: -6.3924 6.4488 6.3221
quadrupole: 3.0504 3.8202 -6.8706 -6.3924 6.4488 6.3221
hfenergy: -919.7206425 hartree
pointgroup: C01 [X(C10H19N1O1S1)]
dipole: 0.9642198 0.1236654 0.6513376 debye
polarizability: 192.2424569|10.4382693|125.1322975|7.2214476|0.6851965|110.2194646 unknown
InChI: InChI=1S/C10H19NOS/c1-4-7-8-13-10(5-2,6-3)9(11)12/h4,7H,5-6,8,11H2,1-3H3
charge 0 multiplicity 1
32 atoms
S  0.361422 -0.422801 0.956877
O  -2.126464 1.570089 -1.52934
N  -0.762602 2.285122 0.205942
C  -1.352101 -0.135198 0.083813
C  -2.375069 -0.249788 1.263228
C  -1.595603 -1.171096 -1.040707
C  -1.430795 1.305616 -0.501126
C  -3.851365 -0.092451 0.834361
C  -1.653427 -2.639507 -0.578456
C  1.58899 -0.188208 -0.500991
C  2.97531 -0.531135 -0.033309
C  3.983221 0.373966 0.089721
C  5.3892 0.050792 0.538131
H  -2.231496 -1.2330 1.750058
H  -2.127231 0.518214 2.02095
H  -2.536015 -0.885501 -1.547164
H  -0.812969 -1.051534 -1.814145
H  -4.504332 -0.116422 1.725653
H  -4.022493 0.861171 0.305588
H  -4.169191 -0.90927 0.162427
H  -1.754679 -3.308427 -1.452368
H  -0.736671 -2.922536 -0.029889
H  -2.51738 -2.829058 0.08427
H  1.253651 -0.870478 -1.300297
H  1.514066 0.855691 -0.848837
H  -0.854703 3.255238 -0.093106
H  -0.151096 2.021257 0.983522
H  3.160323 -1.585537 0.217666
H  3.778164 1.427328 -0.159016
H  5.659922 0.628579 1.44348
H  5.504431 -1.022705 0.768404
H  6.128683 0.317788 -0.241836
