program: Gaussian 09
title: 000047068
version: EM64L-G09RevD.01
frameworkgroup: C1[X(C13H19N2O2)]
method: RPBEPBE
basis: SDD
operation: Freq
keyword: #p
keyword: freq=noraman
keyword: PBEPBE/SDD
title: #p freq=noraman PBEPBE/SDD
converged: YES YES NO NO
title: Mulliken charges:
elementType: O O N N C C C C C C C C C C C C C H H H H H H H H H H H H H H H H H H H
charge: -0.323617 -0.278868 -0.236045 -0.345907 0.590224 -0.557834 -0.557692 -0.595822 -0.467833 -0.378137 0.354466 -0.212281 -0.394197 0.306813 -0.460958 -0.020322 -0.529468 0.282133 0.258047 0.271924 0.272274 0.257957 0.281748 0.283694 0.261075 0.283846 0.334460 0.245319 0.259686 0.285191 0.343997 0.248932 0.250746 0.228246 0.232710 0.225495
chargesum: 1.00000
title: Mulliken charges with hydrogens summed into heavy atoms:
elementType: O O N N C C C C C C C C C C C C C
charge: -0.323617 -0.278868 -0.236045 -0.001910 0.590224 0.254270 0.254287 0.232794 -0.133373 -0.132818 0.354466 0.047405 -0.109007 0.306813 0.038720 0.207923 -0.071262
polarizability: 2.11376725e+02 2.48542342e+00 1.69047482e+02 2.60136064e+00 1.85798607e+00 1.00250006e+02
1716.lowfreq: -10.7053 -6.5747 -0.0005 0.0006 0.0006 7.9781 17.1434 25.6155 43.9735
frequency: 17.0200 25.4537 43.9344 49.0098 68.8279 91.2207 115.0042 132.8003 189.4306 194.5073 235.7183 252.4474 267.3255 303.9962 316.2968 329.6716 335.4573 354.2652 361.9009 378.0988 410.2164 425.2433 463.9203 476.2172 541.6660 576.5333 593.0238 617.4931 647.6368 668.7383 686.4089 692.3061 697.9918 787.4189 789.7904 833.9999 901.7672 903.4141 909.5786 918.2506 930.5018 933.2973 967.4610 973.7980 985.4416 990.1474 1001.3400 1043.2526 1047.5103 1085.2139 1103.5281 1104.4503 1116.0061 1147.1786 1164.3045 1187.7136 1213.4894 1219.9014 1226.5218 1252.0946 1260.3290 1291.4363 1310.0572 1341.8690 1387.4825 1418.9013 1420.8175 1431.2473 1441.8216 1450.8039 1451.3061 1455.7022 1461.8190 1464.8526 1476.4873 1479.5304 1485.6700 1488.0299 1503.1197 1580.1386 1620.3527 1661.1577 1713.6425 3012.7275 3029.6720 3031.0908 3035.4672 3086.4654 3095.4591 3111.8041 3144.3440 3145.0647 3149.3966 3151.4530 3158.1937 3163.2120 3164.9728 3170.9798 3188.9759 3196.8464 3206.5849 3561.2053
redmass: 3.5087 3.6581 3.4808 8.0654 3.1428 3.8414 3.0934 2.9385 1.1994 2.9227 4.8407 2.2194 1.2983 3.6521 5.3835 2.9103 1.0776 2.2717 2.8675 3.8422 2.5706 2.3094 3.1311 3.2771 3.0548 2.6904 1.4205 4.3291 3.0001 5.1743 3.6951 2.6442 4.9996 4.0674 1.4828 3.7128 1.7953 2.5794 1.8387 1.8266 1.7084 2.7300 1.9285 1.3664 5.9887 1.3452 1.2351 1.1929 5.7287 1.6133 1.3204 1.4704 1.4958 2.1511 2.6823 1.1808 1.8787 1.8083 2.4699 1.9603 1.2772 1.2289 1.3351 1.2164 6.6338 1.1403 1.1370 1.1769 2.8299 1.0631 1.1196 1.1585 1.1921 1.1771 1.1757 1.2753 1.0615 1.7542 1.0697 6.6465 6.8158 4.6492 9.6731 1.0631 1.0320 1.0322 1.0330 1.0929 1.0671 1.0958 1.1055 1.1052 1.0909 1.1052 1.1049 1.1060 1.1032 1.0932 1.0986 1.0925 1.1150 1.0778
irintensity: 1.3042 0.8955 0.1436 9.2202 0.3706 4.8845 1.1572 1.0408 0.4199 2.7635 0.2155 1.5951 0.2193 15.1115 7.9585 1.9772 0.1945 0.1444 1.2582 1.4639 0.0371 1.3376 4.4214 0.8184 0.8372 19.2319 103.7981 0.2009 18.8786 4.5247 10.7418 65.7268 1.3016 32.0069 37.7722 81.0755 39.9455 96.7806 2.1329 42.4086 35.8983 25.8827 29.2010 150.2985 9.4533 0.7304 5.6852 0.0541 87.9433 3.9955 5.0642 41.6524 4.7505 71.2770 478.2378 30.4807 0.0512 2.2333 35.4346 30.8829 27.2923 0.2881 63.0606 0.9995 33.7339 18.4917 17.0196 10.7256 74.5099 10.1357 61.0145 25.1957 48.1251 52.4276 259.7087 112.2625 36.5998 49.6135 60.6442 35.9994 121.9990 4.4770 280.7120 24.4893 2.7597 4.4088 4.9168 0.3845 9.6656 10.8947 0.3841 0.5612 7.7542 15.8226 0.2730 1.3737 2.2676 3.9503 0.0456 41.4130 17.0003 67.5211
temp: 298.150 k
press: 1.00000 atm
elementType: 8 8 7 7 6 6 6 6 6 6 6 6 6 6 6 6 6 1 1 1 1 1 1 1 1 1 1 1 1 1 1 1 1 1 1 1
symmnumber: 1
zpe: 793708.2 jmol-1
zpe.correction: 0.302307 hartree
zpe.thermalcorrener: 0.320288 hartree
zpe.thermalcorrenthalpy: 0.321232 hartree
zpe.thermalcorrgfe: 0.254373 hartree
zpe.sumelectzpe: -765.179455 hartree
zpe.sumelectthermal: -765.161475 hartree
zpe.sumelectthermalent: -765.160531 hartree
zpe.sumelectthermalfe: -765.227390 hartree
dipole: 9.0906 -1.9036 0.1377
dipole: 9.2888
quadrupole: -21.4218 -75.2485 -95.5460
quadrupole: -18.5830 0.8605 0.5821
quadrupole: 42.6503 -11.1764 -31.4739 -18.5830 0.8605 0.5821
hfenergy: -765.4817629 hartree
pointgroup: C01 [X(C13H19N2O2)]
dipole: 3.594204 0.6506977 0.1171228 debye
polarizability: 211.1974544|-3.7264422|169.2219958|2.7845981|1.6249665|100.2547634 unknown
InChI: InChI=1S/C13H19N2O2/c1-5-9-14-13(16)17-12-8-6-7-11(10-12)15(2,3)4/h5-8,10,14H,1,9H2,2-4H3
charge 1 multiplicity 1
36 atoms
O  -1.217897 -1.287605 0.127343
O  -1.663627 1.040219 0.508969
N  3.176797 1.174496 0.210678
N  -3.354862 -0.589493 0.390873
C  2.33173 -0.099111 0.07262
C  3.977161 1.39906 -1.080434
C  4.137943 1.023466 1.398566
C  2.329209 2.424942 0.454938
C  0.932358 -0.015509 0.1772
C  3.000877 -1.320515 -0.15508
C  0.179816 -1.212545 0.047766
C  2.224962 -2.495382 -0.280376
C  0.821866 -2.451558 -0.180301
C  -2.075291 -0.134757 0.359569
C  -4.510741 0.333536 0.51952
C  -5.058178 0.777745 -0.826469
C  -5.12801 2.072582 -1.218913
H  3.269328 1.490181 -1.917265
H  4.570342 2.32079 -0.974895
H  4.642328 0.542531 -1.253368
H  4.796894 0.161316 1.229804
H  4.736734 1.943062 1.489805
H  3.543238 0.859279 2.309073
H  1.755753 2.307149 1.385177
H  3.012527 3.282861 0.546312
H  1.647777 2.581983 -0.393031
H  0.384841 0.910382 0.349396
H  4.089676 -1.391745 -0.237909
H  2.724823 -3.451953 -0.457377
H  0.215394 -3.355891 -0.275749
H  -3.511308 -1.587604 0.238471
H  -5.287776 -0.196279 1.101293
H  -4.181787 1.207171 1.106149
H  -5.428641 -0.017942 -1.488891
H  -5.554609 2.354265 -2.187654
H  -4.770048 2.888774 -0.579611
