program: Gaussian 09
title: 000047078
version: EM64L-G09RevD.01
frameworkgroup: C1[X(C10H11N5O4)]
method: RPBEPBE
basis: SDD
operation: Freq
keyword: #p
keyword: freq=noraman
keyword: PBEPBE/SDD
title: #p freq=noraman PBEPBE/SDD
converged: YES YES NO NO
title: Mulliken charges:
elementType: O O O O N N N N N C C C C C C C C C C H H H H H H H H H H H
charge: -0.247250 -0.241332 -0.214187 -0.208998 -0.201156 -0.103710 -0.403877 -0.129701 0.049613 -0.388414 0.141416 0.218445 0.295473 -0.651978 -0.307845 -0.309980 0.285997 0.236476 -0.765447 0.269750 0.297742 0.218859 0.239587 0.232894 0.298736 0.339991 0.295552 0.267538 0.262493 0.223314
chargesum: 0.00000
title: Mulliken charges with hydrogens summed into heavy atoms:
elementType: O O O O N N N N N C C C C C C C C C C
charge: -0.247250 -0.241332 -0.214187 -0.208998 -0.201156 -0.103710 -0.063886 -0.129701 0.049613 0.179079 0.141416 0.218445 0.295473 0.039362 -0.009109 -0.014428 0.285997 0.236476 -0.012102
polarizability: 3.16927192e+02 1.28647392e+01 1.72794487e+02 5.87727787e+00 4.34024032e+00 8.56105984e+01
1716.lowfreq: -6.5864 -3.3224 -0.0009 -0.0007 -0.0006 3.1214 18.7724 22.8860 29.6926
frequency: 18.7466 22.7797 29.6544 36.2555 52.9103 65.3576 79.2764 115.7374 125.7276 149.9335 179.0242 199.1258 213.4934 261.7713 264.5959 307.5023 341.8697 365.1540 369.0553 431.7111 462.7209 499.4643 551.7390 559.2371 568.4974 587.3008 632.0695 632.9621 649.1316 675.0519 683.4505 717.3162 732.8498 789.0458 818.1495 827.3696 886.5500 912.4598 916.3868 930.0661 958.2469 970.8145 996.8530 1018.1889 1041.5681 1058.2671 1071.9839 1087.5661 1131.9298 1173.5182 1179.4533 1196.9486 1222.7368 1255.8205 1262.9479 1304.4870 1330.4677 1341.1420 1360.6966 1377.7339 1392.0496 1393.6270 1402.2162 1448.6697 1466.7395 1469.4331 1475.8555 1482.3433 1495.1046 1519.1345 1525.8179 1604.8205 1635.8318 2992.8996 3002.3168 3059.0006 3087.7280 3098.5428 3099.4568 3110.6057 3129.7383 3244.1633 3261.1111 3522.4418
redmass: 3.8268 1.3565 2.3511 5.0632 4.0793 8.0707 6.7639 5.8115 6.0466 5.8690 5.7591 1.0922 7.4346 5.4036 6.5573 3.6889 3.2660 7.4050 5.2672 4.1330 7.6275 4.8191 5.3165 5.7834 4.8392 2.8230 1.9466 3.7418 3.7409 9.9463 6.8489 6.7071 12.7085 1.8375 2.0067 1.3094 8.0687 1.3766 8.0321 5.6239 4.3858 2.4533 1.6826 1.3212 1.6456 5.4346 3.5729 2.1949 6.2165 3.1130 3.7602 1.8303 3.1991 4.1897 7.2694 1.8759 2.3775 6.5114 2.0589 2.7930 1.2160 1.2196 5.0144 1.0466 1.1640 1.0512 1.1081 1.5019 2.1082 4.7536 2.1741 8.3746 6.0453 1.0358 1.0363 1.0639 1.1011 1.0977 1.0982 1.1009 1.1043 1.0951 1.1048 1.0762
irintensity: 3.2085 0.7915 1.7683 1.7982 8.0826 3.1201 10.2632 0.9193 5.3778 9.4467 0.2526 0.7625 6.1609 1.0596 1.3083 0.9618 2.0575 0.4665 1.8790 2.6986 2.8691 5.0594 1.7864 0.9468 19.7085 3.4015 71.5182 15.8782 20.1628 9.3843 2.4562 26.0230 11.2728 0.5636 11.9268 63.1058 10.9558 0.7345 9.0174 2.2445 4.4644 8.0819 40.4763 35.6438 17.9591 68.7627 13.8085 5.2580 159.3201 34.3389 122.5663 61.7367 48.1372 119.4466 357.2997 13.9439 18.1993 100.6014 30.8652 12.0130 92.0004 11.4424 47.5253 18.9913 12.9189 12.3219 9.1946 41.8635 540.3925 166.0377 119.0493 84.9361 113.7193 15.5345 6.8520 9.4597 22.3882 19.6724 7.5891 11.8497 2.7637 1.0559 8.8620 51.8343
temp: 298.150 k
press: 1.00000 atm
elementType: 8 8 8 8 7 7 7 7 7 6 6 6 6 6 6 6 6 6 6 1 1 1 1 1 1 1 1 1 1 1
symmnumber: 1
zpe: 567762.7 jmol-1
zpe.correction: 0.216249 hartree
zpe.thermalcorrener: 0.234445 hartree
zpe.thermalcorrenthalpy: 0.235389 hartree
zpe.thermalcorrgfe: 0.165885 hartree
zpe.sumelectzpe: -960.805893 hartree
zpe.sumelectthermal: -960.787698 hartree
zpe.sumelectthermalent: -960.786754 hartree
zpe.sumelectthermalfe: -960.856258 hartree
dipole: 5.6739 0.9132 2.2738
dipole: 6.1804
quadrupole: -102.7668 -123.8627 -111.2490
quadrupole: -21.0903 7.3918 -4.9615
quadrupole: 9.8593 -11.2365 1.3772 -21.0903 7.3918 -4.9615
hfenergy: -961.0221427 hartree
pointgroup: C01 [X(C10H11N5O4)]
dipole: -2.1457875 0.3567899 1.0866271 debye
polarizability: 314.1292568|-13.0561762|150.8071118|-27.6574835|-35.983925|110.3959087 unknown
InChI: InChI=1S/C10H11N5O4/c1-3-14-9(12-13-10(14)11-6(2)16)7-4-5-8(19-7)15(17)18/h4-5,11H,3H2,1-2H3
charge 0 multiplicity 1
30 atoms
O  1.981191 0.075419 -0.438231
O  -3.463831 1.185317 -1.793403
O  5.495538 0.164958 -1.130195
O  3.82639 1.693687 -1.563987
N  -1.01021 0.140468 0.000238
N  -0.802087 -1.829033 1.127158
N  -3.479145 0.401228 0.414581
N  -2.147864 -1.44969 1.159176
N  4.258977 0.564696 -1.098398
C  -0.662213 1.436771 -0.652694
C  -0.12902 -0.868784 0.422134
C  -2.249017 -0.272107 0.477565
C  1.289222 -0.978968 0.189847
C  -0.416554 2.54559 0.388375
C  2.186218 -2.006112 0.515339
C  3.482723 -1.591572 0.077436
C  3.323312 -0.331933 -0.494355
C  -4.071138 1.028775 -0.698116
C  -5.493329 1.518653 -0.466063
H  0.241569 1.273207 -1.25664
H  -1.490956 1.685926 -1.332345
H  -1.313007 2.727461 1.007528
H  -0.165896 3.483627 -0.137061
H  0.428522 2.294409 1.052475
H  1.910926 -2.93503 1.00814
H  -4.093466 0.160398 1.19787
H  4.421569 -2.132745 0.159291
H  -6.141552 1.112523 -1.260601
H  -5.515861 2.618527 -0.559175
H  -5.90841 1.238935 0.51661
