program: Gaussian 09
title: 000048173
version: EM64L-G09RevD.01
frameworkgroup: C1[X(C10H14N2O3)]
method: RPBEPBE
basis: SDD
operation: Freq
keyword: #p
keyword: freq=noraman
keyword: PBEPBE/SDD
title: #p freq=noraman PBEPBE/SDD
converged: YES YES NO NO
title: Mulliken charges:
elementType: O O O N N C C C C C C C C C C H H H H H H H H H H H H H H
charge: -0.219614 -0.213667 -0.220406 -0.372415 -0.366741 0.069661 -0.414041 -0.356564 0.121121 0.137530 -0.242845 -0.696398 0.161548 -0.140392 -0.745014 0.242816 0.232667 0.213220 0.212144 0.276089 0.367136 0.366939 0.215564 0.216099 0.219872 0.249524 0.231056 0.227075 0.228038
chargesum: 0.00000
title: Mulliken charges with hydrogens summed into heavy atoms:
elementType: O O O N N C C C C C C C C C C
charge: -0.219614 -0.213667 -0.220406 -0.005280 0.000199 0.069661 0.061442 0.068799 0.121121 0.137530 0.033244 -0.044863 0.161548 0.109132 -0.058845
polarizability: 1.28491330e+02 2.05937858e+00 1.46457309e+02 9.08442820e+00 1.65982241e+00 1.18521417e+02
1716.lowfreq: -14.2165 -8.1986 -0.0006 0.0004 0.0006 8.1509 21.9162 47.9124 70.7744
frequency: 21.4958 47.8893 70.7198 94.9944 107.7340 129.9386 139.1917 156.1602 170.0383 191.5801 223.3179 262.4204 268.3973 279.8525 318.4420 338.7130 358.5965 378.7320 478.8080 481.6551 507.0962 595.4735 631.2679 656.9688 687.3201 734.5596 741.1708 752.9903 765.0478 789.1809 797.6965 846.2675 896.1885 931.9905 965.7467 984.3891 992.0346 1036.7060 1046.9691 1047.9823 1082.3279 1111.9694 1121.4477 1152.3660 1209.6660 1251.8886 1281.8182 1286.5303 1308.4484 1308.8821 1328.5050 1354.6886 1367.5389 1376.8885 1377.4498 1392.2086 1395.7570 1446.8458 1460.5911 1469.3209 1470.9004 1477.4509 1484.2987 1613.9084 1647.9349 1673.1592 1678.4178 2970.9473 2974.2819 2978.4404 3014.1812 3022.9558 3046.7056 3072.8956 3078.8601 3082.5760 3084.6893 3101.2722 3117.0310 3517.7939 3519.4730
redmass: 6.7611 2.9960 2.9236 1.7532 2.3887 2.2938 6.4355 8.8520 5.0007 1.3517 1.2090 2.9449 2.3209 4.2548 4.0697 3.6774 10.7275 10.1936 6.2645 6.0324 4.6393 8.4252 3.9965 2.4640 2.8412 1.2370 3.4613 2.8069 2.1670 1.6395 1.8104 1.4955 2.0324 1.9219 1.6000 1.1267 3.5829 4.0660 1.6099 3.0614 3.7763 2.2052 2.5102 2.6333 3.4145 1.2885 1.6830 1.2819 1.3820 1.4724 1.5857 1.5047 8.1784 1.6393 1.8867 1.2086 1.2285 1.0861 1.0471 1.0636 1.0657 1.0419 1.0690 6.8681 8.2654 6.0429 5.5084 1.0365 1.0580 1.0365 1.0593 1.1011 1.0969 1.1014 1.0994 1.0981 1.1039 1.0934 1.0894 1.0757 1.0781
irintensity: 1.0678 0.4790 0.0411 0.1278 0.5341 0.3573 1.3274 9.6255 2.6995 1.5482 0.1888 0.7945 1.1629 5.4470 2.3206 0.9167 25.7653 5.6514 21.1048 30.9055 6.2205 0.3614 4.0610 1.6325 24.3570 3.9246 12.7410 3.2398 8.7243 141.4643 71.2507 1.7827 2.2068 3.4007 12.2913 42.3112 1.6239 2.0198 3.3654 41.6061 2.4726 0.6218 3.1849 1.8591 37.4819 7.9735 126.9141 22.1695 71.7424 82.9527 79.2809 16.5451 216.7444 1.9142 7.4299 7.6478 10.7724 20.3307 15.6638 19.9741 2.2859 14.4635 13.1468 286.7131 81.3269 8.5033 609.3381 32.0172 31.3365 29.3324 17.0503 7.6460 19.7629 20.1214 41.4354 17.0075 33.4556 4.6458 15.4105 84.8648 42.9317
temp: 298.150 k
press: 1.00000 atm
elementType: 8 8 8 7 7 6 6 6 6 6 6 6 6 6 6 1 1 1 1 1 1 1 1 1 1 1 1 1 1
symmnumber: 1
zpe: 607936.4 jmol-1
zpe.correction: 0.231551 hartree
zpe.thermalcorrener: 0.247333 hartree
zpe.thermalcorrenthalpy: 0.248277 hartree
zpe.thermalcorrgfe: 0.187605 hartree
zpe.sumelectzpe: -723.534812 hartree
zpe.sumelectthermal: -723.519030 hartree
zpe.sumelectthermalent: -723.518086 hartree
zpe.sumelectthermalfe: -723.578758 hartree
dipole: -0.5030 -1.3497 -0.0226
dipole: 1.4405
quadrupole: -83.8149 -95.6805 -96.7619
quadrupole: 6.0935 -1.6418 -0.8705
quadrupole: 8.2709 -3.5947 -4.6761 6.0935 -1.6418 -0.8705
hfenergy: -723.7663626 hartree
pointgroup: C01 [X(C10H14N2O3)]
dipole: -0.2490616 0.4990689 0.1004668 debye
polarizability: 127.5270974|-2.3187019|145.0587195|-10.3702123|4.5885727|120.8842394 unknown
InChI: InChI=1S/C10H14N2O3/c1-3-5-10(6-4-2)7(13)11-9(15)12-8(10)14/h3,5,11-12H,4,6H2,1-2H3
charge 0 multiplicity 1
29 atoms
O  -0.037394 0.023214 2.264374
O  0.483605 0.078858 -2.569996
O  -0.526539 -3.831669 -0.273292
N  -0.323585 -1.85136 0.952842
N  -0.039017 -1.836698 -1.390997
C  0.035716 0.37065 -0.169899
C  1.253264 1.349232 -0.02538
C  2.626955 0.650607 0.086302
C  -0.093626 -0.470918 1.108425
C  0.199515 -0.452856 -1.466543
C  -1.250268 1.203386 -0.387104
C  3.771193 1.676867 0.232772
C  -0.318467 -2.594113 -0.240454
C  -2.214453 1.471668 0.52862
C  -3.418087 2.34247 0.25144
H  1.064135 1.961636 0.874483
H  1.245176 2.019305 -0.90448
H  2.807599 0.0303 -0.8141
H  2.632783 -0.029713 0.961257
H  -1.31279 1.627267 -1.399653
H  -0.474621 -2.393644 1.810082
H  0.003256 -2.364085 -2.269435
H  3.805721 2.356659 -0.638822
H  3.635153 2.294857 1.139705
H  4.752505 1.174755 0.309409
H  -2.131355 1.065586 1.546313
H  -3.44105 3.211328 0.937277
H  -3.422997 2.720492 -0.785569
H  -4.357327 1.780815 0.420021
