program: Gaussian 09
title: 000048154
version: EM64L-G09RevD.01
frameworkgroup: C1[X(C12H20N2O3)]
method: RPBEPBE
basis: SDD
operation: Freq
keyword: #p
keyword: freq=noraman
keyword: PBEPBE/SDD
title: #p freq=noraman PBEPBE/SDD
converged: YES YES NO NO
title: Mulliken charges:
elementType: O O O N N C C C C C C C C C C C C H H H H H H H H H H H H H H H H H H H H
charge: -0.209284 -0.217745 -0.221685 -0.377952 -0.380658 0.083471 -0.483144 0.006786 -0.398655 0.152047 0.156532 -0.373279 -0.378982 -0.748878 -0.718395 -0.695040 0.143507 0.233376 0.221738 0.218715 0.245694 0.208497 0.196897 0.198734 0.241588 0.207692 0.227748 0.225721 0.207882 0.365741 0.363320 0.214647 0.217621 0.216095 0.211240 0.213102 0.225306
chargesum: 0.00000
title: Mulliken charges with hydrogens summed into heavy atoms:
elementType: O O O N N C C C C C C C C C C C C
charge: -0.209284 -0.217745 -0.221685 -0.012211 -0.017338 0.083471 -0.028029 0.225500 0.055536 0.152047 0.156532 0.022353 0.070298 -0.087527 -0.070033 -0.045393 0.143507
polarizability: 1.56408747e+02 1.38505023e+01 1.60956374e+02 3.05943312e+00 -2.30688081e-01 1.36334807e+02
1716.lowfreq: -6.1299 -4.8503 -0.0005 0.0002 0.0006 6.2326 15.2437 32.1907 42.1546
frequency: 14.4161 32.1342 42.0783 56.5212 72.7144 94.1245 116.1708 140.4577 144.7947 163.3897 205.6126 207.6681 220.3274 227.1043 239.3040 256.7264 272.2557 301.6119 320.7335 357.6896 374.9814 406.4440 429.2300 477.8493 483.5364 513.5138 595.4253 628.6916 657.8692 684.2671 720.9025 734.5579 753.8390 757.7972 768.0599 786.9904 796.2519 840.4748 862.1361 900.9353 909.5873 960.6286 969.1804 984.2148 993.7734 1018.3166 1031.2325 1051.4699 1063.4192 1109.6354 1138.0328 1145.1603 1159.0823 1162.3444 1197.2322 1232.6531 1260.8107 1277.5827 1290.4691 1295.5381 1298.2118 1310.7594 1337.2893 1345.5902 1351.7557 1361.6466 1367.0885 1375.1438 1376.1396 1388.8810 1392.7036 1393.4103 1446.3488 1460.4619 1464.7779 1474.1035 1474.6878 1475.5097 1477.3861 1485.7436 1488.2034 1495.8109 1613.7833 1649.0469 1676.6102 2959.4969 2967.2303 2975.1317 2975.9139 2977.4422 2978.2841 3001.3008 3005.5047 3014.3772 3029.8586 3053.6137 3059.7616 3070.2585 3071.2354 3075.6789 3079.7616 3080.9634 3081.3708 3518.4886 3520.3817
redmass: 1.8861 3.4303 3.2581 2.5088 3.5936 2.3234 3.9181 4.5271 6.7946 8.8386 1.5558 2.1596 1.7728 1.2826 2.2859 2.5083 1.8993 2.6342 2.4166 10.9424 10.0559 1.9531 3.2201 5.2266 8.4836 3.0135 8.3907 4.3812 2.4169 2.4566 4.4673 1.2358 3.4851 1.9660 1.3078 1.7197 2.1766 1.7154 1.3677 1.9879 2.0543 1.4310 2.2492 2.2025 3.4294 1.7862 2.2561 2.9103 2.2399 2.1712 2.4267 2.6725 2.6720 2.1165 3.0142 1.3115 1.4141 1.2145 1.4602 1.4667 1.6629 1.3168 1.3977 1.4318 1.4722 1.4887 4.8991 1.9982 1.5311 1.2392 1.2060 1.2004 1.0900 1.0832 1.0710 1.0660 1.0437 1.0476 1.0420 1.0587 1.0883 1.0459 6.8146 8.4840 5.5165 1.0599 1.0603 1.0362 1.0360 1.0376 1.0811 1.0619 1.0608 1.1003 1.0993 1.1009 1.0971 1.0996 1.1001 1.0996 1.0989 1.1020 1.0995 1.0759 1.0780
irintensity: 0.2049 0.1866 0.1676 0.0348 0.1090 0.1385 0.0958 3.5973 0.3011 9.8206 0.3536 0.1835 1.3582 0.1043 1.8863 0.9510 0.7899 3.0201 2.5000 24.8236 5.4693 0.7882 2.1142 25.2559 14.6827 3.8986 0.5202 4.0521 0.9381 28.9700 6.5990 10.8084 1.8327 3.2984 5.7858 212.6007 7.7010 1.8077 3.7683 1.1490 5.2096 4.5182 22.8580 8.6692 7.5941 3.2945 4.2306 3.0490 4.9951 7.5538 6.0893 20.7957 9.7278 11.6618 27.1660 8.3701 26.6271 6.2050 67.1401 42.9373 150.5834 35.7220 15.2802 5.1916 24.7286 34.6332 164.5108 8.5727 6.1342 17.9731 11.1450 18.2117 10.7609 3.6281 5.3993 6.1854 11.8818 4.9891 12.9293 19.7987 12.8005 12.0372 284.1730 76.3836 617.0725 31.2275 14.6496 33.1263 47.4189 22.8147 5.7993 18.0869 19.8342 19.4110 4.9441 0.7053 54.6562 34.2187 17.8481 62.9639 44.1629 70.6187 23.7045 82.3362 45.6978
temp: 298.150 k
press: 1.00000 atm
elementType: 8 8 8 7 7 6 6 6 6 6 6 6 6 6 6 6 6 1 1 1 1 1 1 1 1 1 1 1 1 1 1 1 1 1 1 1 1
symmnumber: 1
zpe: 815776.0 jmol-1
zpe.correction: 0.310713 hartree
zpe.thermalcorrener: 0.329609 hartree
zpe.thermalcorrenthalpy: 0.330553 hartree
zpe.thermalcorrgfe: 0.261981 hartree
zpe.sumelectzpe: -803.174836 hartree
zpe.sumelectthermal: -803.155940 hartree
zpe.sumelectthermalent: -803.154995 hartree
zpe.sumelectthermalfe: -803.223568 hartree
dipole: 0.1458 1.5658 0.1803
dipole: 1.5828
quadrupole: -103.5976 -107.2112 -112.5488
quadrupole: -6.8045 -1.1175 0.8569
quadrupole: 4.1882 0.5746 -4.7629 -6.8045 -1.1175 0.8569
hfenergy: -803.4855488 hartree
pointgroup: C01 [X(C12H20N2O3)]
dipole: -0.1067644 0.6083044 -0.07978 debye
polarizability: 158.7564823|-13.9358818|158.9411301|2.0406675|0.7245649|136.0023162 unknown
InChI: InChI=1S/C12H20N2O3/c1-4-6-12(7-8(3)5-2)9(15)13-11(17)14-10(12)16/h8,13-14H,4-7H2,1-3H3
charge 0 multiplicity 1
37 atoms
O  0.146157 -0.680709 -2.543743
O  0.271261 0.639441 2.124675
O  2.845348 -2.880765 0.531519
N  1.496183 -1.723769 -0.988534
N  1.588725 -1.051779 1.271693
C  0.276591 0.377283 -0.323881
C  -1.224263 0.794612 -0.399218
C  -2.269934 -0.162847 0.239483
C  1.21181 1.588276 -0.780905
C  0.589624 -0.712594 -1.367749
C  0.67206 0.009826 1.111302
C  -3.679367 0.468837 0.050106
C  1.139821 2.883267 0.057079
C  -2.216893 -1.602701 -0.323652
C  -4.805151 -0.222999 0.848903
C  2.169426 3.917803 -0.451465
C  2.040089 -1.948384 0.287516
H  -1.458325 0.936911 -1.47233
H  -1.323855 1.77404 0.100041
H  -2.071218 -0.20463 1.330492
H  0.929613 1.806435 -1.829375
H  2.262671 1.231305 -0.799344
H  -3.630609 1.534088 0.356014
H  -3.932238 0.465033 -1.030811
H  1.321945 2.665638 1.124804
H  0.126248 3.320842 -0.004139
H  -2.358685 -1.607382 -1.420437
H  -3.004394 -2.229971 0.129973
H  -1.25455 -2.10412 -0.105847
H  1.774598 -2.392608 -1.714169
H  1.920819 -1.235402 2.224426
H  -4.568773 -0.242376 1.929668
H  -5.763332 0.313992 0.723891
H  -4.965938 -1.265254 0.519151
H  3.20266 3.53296 -0.360137
H  1.99643 4.169011 -1.514814
H  2.106547 4.854392 0.131113
