program: Gaussian 09
title: 000048145
version: EM64L-G09RevD.01
frameworkgroup: C1[X(C14H23N3O)]
method: RPBEPBE
basis: SDD
operation: Freq
keyword: #p
keyword: freq=noraman
keyword: PBEPBE/SDD
title: #p freq=noraman PBEPBE/SDD
converged: YES YES NO NO
title: Mulliken charges:
elementType: O N N N C C C C C C C C C C C C C C H H H H H H H H H H H H H H H H H H H H H H H
charge: -0.282331 -0.090393 -0.099655 -0.688707 -0.363588 -0.468154 0.025193 0.308347 0.383069 0.140583 -0.616037 -0.614683 -0.389801 -0.339536 -0.363068 -0.414495 -0.689787 -0.692612 0.216000 0.195527 0.212079 0.203112 0.198221 0.220006 0.188136 0.219786 0.216708 0.186177 0.226793 0.275554 0.213447 0.237213 0.247924 0.211980 0.245169 0.227883 0.203903 0.235322 0.224791 0.338496 0.311425
chargesum: 0.00000
title: Mulliken charges with hydrogens summed into heavy atoms:
elementType: O N N N C C C C C C C C C C C C C C
charge: -0.282331 -0.090393 -0.099655 -0.038786 0.047940 -0.052963 0.223414 0.308347 0.383069 0.140583 0.011892 0.014997 -0.114247 -0.126089 -0.125855 -0.166571 -0.004755 -0.028596
polarizability: 2.89030634e+02 -5.02222433e+00 1.75682384e+02 4.30297550e+00 -7.15907232e-01 1.14901181e+02
1716.lowfreq: -10.2274 -6.2201 -0.0005 0.0004 0.0011 0.3740 21.2316 26.0011 37.3422
frequency: 21.2109 25.9836 37.3154 47.2009 55.8952 84.2184 100.9216 110.4197 117.3260 169.3029 181.0756 202.2478 205.2779 217.5476 230.7978 238.8234 271.1396 293.5656 319.3085 350.1545 352.0074 372.3178 410.2430 423.3689 431.4842 433.5376 448.7501 460.5666 468.1932 509.9733 534.7772 605.9011 629.8326 671.8166 719.0979 739.8082 780.2421 793.2535 822.2790 824.6639 838.7894 853.1592 922.9455 927.0007 940.8695 949.4584 953.4663 978.9930 1000.9103 1023.0826 1033.2446 1045.9930 1075.3174 1088.3175 1099.2603 1106.8382 1124.1681 1131.7350 1134.2644 1150.6259 1161.0332 1174.4190 1186.2655 1223.8086 1243.7957 1266.4100 1292.3299 1302.1639 1316.8235 1319.3205 1345.1731 1358.6132 1369.2814 1371.7423 1381.0040 1397.0203 1417.6767 1421.0839 1439.4821 1449.2675 1455.4277 1460.5922 1464.4971 1467.9847 1469.4305 1474.8788 1476.5348 1485.7715 1488.7633 1501.7034 1567.7645 1596.6314 1621.2272 1636.6437 2842.3126 2853.4164 2880.4778 2888.0976 2935.4513 2980.1339 2988.6127 2993.6072 3014.8288 3023.2138 3044.4436 3074.8512 3081.9949 3084.4703 3093.3942 3095.9506 3102.3208 3123.5642 3149.3964 3164.2059 3169.8530 3554.1708 3693.0693
redmass: 2.8056 3.3623 3.6788 3.9661 3.5409 3.1663 2.1554 3.7429 3.3251 2.2012 1.2207 3.6419 3.0330 1.1322 1.2702 1.3746 2.0440 3.0496 3.2717 3.2954 2.4874 2.9172 2.3239 2.2055 2.1423 1.8167 1.5373 2.5054 2.6907 2.6565 3.1699 4.3774 6.5788 4.5999 3.6192 4.1526 3.8431 1.2532 1.3775 3.2002 1.7476 3.1989 2.6981 1.3658 1.3334 1.5215 3.4733 1.3645 2.7481 2.3742 1.4885 1.7288 2.1042 1.3194 1.8868 1.9267 2.5991 1.5197 1.4258 2.0478 1.5843 1.3687 1.8452 2.9090 1.7995 2.5395 1.1418 1.2991 1.4201 1.2820 1.4013 4.1175 4.8282 1.4389 1.2621 1.2276 1.1439 4.1783 1.1453 1.0965 1.0498 1.0536 1.0656 1.0507 1.0489 1.0607 1.0738 1.0536 1.0580 2.7082 7.0077 3.2943 5.1053 1.5742 1.0574 1.0586 1.0662 1.0575 1.1007 1.0842 1.0359 1.0362 1.0721 1.0718 1.0911 1.1005 1.0997 1.0992 1.0997 1.1000 1.1003 1.0885 1.0874 1.0947 1.0960 1.0446 1.1033
irintensity: 0.4600 0.0644 2.0859 1.8818 4.8705 0.5010 1.7802 1.2534 2.6163 1.2916 0.7058 3.8976 3.1747 1.3335 0.4759 0.5386 3.9040 1.0553 0.6147 8.3628 10.6356 0.7022 19.0999 54.6986 32.8957 65.8953 79.4795 16.3135 4.6597 1.2900 1.8850 9.9832 4.4240 24.0241 6.1843 6.7355 4.9111 1.0845 12.0342 8.3016 65.3531 21.9452 50.2825 15.4520 0.0883 6.0947 10.4106 3.7650 9.9850 63.0032 14.7333 5.5337 8.6414 10.9876 31.6852 91.2031 1.7443 15.1513 12.1213 14.8239 5.5119 65.1821 137.9709 214.9006 13.3288 9.7851 7.2376 0.2163 21.9940 24.3454 3.5084 109.4355 68.4240 8.2124 31.4417 29.4342 4.9323 2.2017 5.6708 5.4659 4.9555 16.5570 10.3610 3.8551 5.8108 9.0738 28.1686 11.4329 16.1574 139.4870 17.9260 183.2154 81.0062 254.6672 72.4954 174.0278 55.6597 122.9561 58.7629 26.2237 16.1757 28.8555 48.9230 54.1692 26.5745 37.0607 60.8087 13.1315 42.1533 27.6064 37.4947 20.0332 7.4178 12.0042 10.7770 19.1693 20.1002
temp: 298.150 k
press: 1.00000 atm
elementType: 8 7 7 7 6 6 6 6 6 6 6 6 6 6 6 6 6 6 1 1 1 1 1 1 1 1 1 1 1 1 1 1 1 1 1 1 1 1 1 1 1
symmnumber: 1
zpe: 918293.5 jmol-1
zpe.correction: 0.349760 hartree
zpe.thermalcorrener: 0.370297 hartree
zpe.thermalcorrenthalpy: 0.371241 hartree
zpe.thermalcorrgfe: 0.298752 hartree
zpe.sumelectzpe: -785.338277 hartree
zpe.sumelectthermal: -785.317739 hartree
zpe.sumelectthermalent: -785.316795 hartree
zpe.sumelectthermalfe: -785.389285 hartree
dipole: 0.9200 0.3593 -0.5715
dipole: 1.1411
quadrupole: -95.5194 -94.7056 -113.5451
quadrupole: -10.3541 -2.2336 -2.2924
quadrupole: 5.7373 6.5511 -12.2884 -10.3541 -2.2336 -2.2924
hfenergy: -785.6880367 hartree
pointgroup: C01 [X(C14H23N3O1)]
dipole: -0.3676184 -0.1307721 -0.2220592 debye
polarizability: 288.6974722|-5.1803643|175.5603735|-8.465475|3.3186067|115.3563529 unknown
InChI: InChI=1S/C14H23N3O/c1-11(2)18-13-7-5-12(6-8-13)14(15)16-9-10-17(3)4/h5-8,11H,9-10,15H2,1-4H3
charge 0 multiplicity 1
41 atoms
O  -4.445302 -0.190347 0.510738
N  5.700068 0.760791 -0.047689
N  2.03047 -0.166394 0.109173
N  1.550349 -2.404728 -0.632803
C  4.237308 0.904272 0.14976
C  3.472305 -0.410244 -0.099443
C  -5.042228 1.175848 0.564095
C  -0.284026 -0.892058 0.004178
C  -3.063253 -0.336052 0.330637
C  1.180705 -1.134235 -0.172168
C  6.367552 0.053143 1.063785
C  6.361062 2.04781 -0.342232
C  -0.75824 0.441362 0.075832
C  -1.232441 -1.946347 0.113287
C  -2.127917 0.729225 0.23271
C  -2.603387 -1.675695 0.272698
C  -5.174692 1.751112 -0.857033
C  -6.392075 0.98725 1.263462
H  3.858325 1.652298 -0.570177
H  3.976764 1.279663 1.170523
H  3.707824 -0.753408 -1.134653
H  3.845837 -1.200351 0.593372
H  -4.387754 1.819823 1.187144
H  5.914748 -0.941888 1.215151
H  6.307037 0.608607 2.035517
H  7.435261 -0.096906 0.821184
H  7.429187 1.874221 -0.568676
H  6.306144 2.783107 0.501644
H  5.895443 2.5117 -1.229835
H  -0.018707 1.245472 0.010504
H  -0.907914 -2.993854 0.119404
H  -2.449288 1.773905 0.276928
H  -3.335201 -2.483259 0.371084
H  -5.607413 2.767751 -0.818758
H  -4.19815 1.810022 -1.367227
H  -5.841209 1.111012 -1.461539
H  -6.912773 1.95708 1.360157
H  -6.251474 0.559536 2.27058
H  -7.03188 0.301072 0.681231
H  2.533312 -2.638682 -0.744523
H  0.86012 -3.059031 -0.990521
