program: Gaussian 09
title: 000047000
version: EM64L-G09RevD.01
frameworkgroup: C1[X(C17H25NO2)]
method: RPBEPBE
basis: SDD
operation: Freq
keyword: #p
keyword: freq=noraman
keyword: PBEPBE/SDD
title: #p freq=noraman PBEPBE/SDD
converged: YES YES NO NO
title: Mulliken charges:
elementType: O O N C C C C C C C C C C C C C C C C C H H H H H H H H H H H H H H H H H H H H H H H H H
charge: -0.280095 -0.259918 -0.118718 0.034216 -0.410947 -0.365810 -0.416169 -0.390138 -0.344274 -0.764149 -0.432247 -0.350403 -0.306859 0.193789 0.217229 -0.342212 -0.339511 -0.220878 -0.218307 -0.223686 0.169231 0.202589 0.187021 0.171854 0.207728 0.190020 0.213545 0.203674 0.190493 0.185296 0.215530 0.216133 0.214929 0.230260 0.208815 0.194976 0.239823 0.221529 0.216182 0.225313 0.269716 0.270856 0.232262 0.230043 0.231273
chargesum: 0.00000
title: Mulliken charges with hydrogens summed into heavy atoms:
elementType: O O N C C C C C C C C C C C C C C C C C
charge: -0.280095 -0.259918 -0.118718 0.203446 -0.021338 0.013772 -0.012604 0.004029 0.056552 -0.102827 -0.028456 0.110948 0.134636 0.193789 0.217229 -0.072496 -0.068655 0.011384 0.011736 0.007587
polarizability: 2.28054284e+02 2.26460431e+01 1.85645636e+02 2.09414675e+01 -1.43372503e+01 1.71233747e+02
1716.lowfreq: -5.4158 -0.0005 -0.0004 0.0006 4.5661 14.3566 17.6295 20.3805 26.9176
frequency: 17.4822 19.8923 26.5122 40.2563 49.4157 61.9806 87.0590 116.5975 150.1346 157.1723 169.8712 193.2926 217.1593 246.7019 259.9843 310.8295 313.8159 323.7539 329.9120 376.1832 404.6157 411.2093 421.2606 441.0039 447.1496 471.2239 503.6330 533.8468 544.0013 615.4144 659.4402 679.8252 696.4521 701.5155 752.4115 775.7594 795.3560 813.3220 822.0742 845.2429 864.4397 869.4295 889.5377 894.1102 912.7469 934.0699 954.0414 984.3141 990.3003 994.1659 995.9014 999.1347 1007.7465 1020.8580 1050.0512 1053.0016 1062.3935 1078.7444 1083.2643 1087.6415 1094.6481 1121.1341 1126.1216 1140.8675 1158.6794 1173.3358 1178.1733 1182.9529 1213.9162 1219.4353 1244.3845 1247.1044 1263.8647 1270.4228 1279.5976 1283.0698 1296.7547 1302.8825 1313.6077 1327.0890 1339.2927 1346.7966 1350.5705 1353.1443 1368.3430 1371.1806 1381.0414 1384.9188 1390.2308 1438.6341 1448.3891 1452.1505 1457.9660 1462.9054 1463.7021 1470.6617 1475.1701 1478.8303 1479.1773 1487.4673 1490.5978 1584.4934 1611.8849 1619.6632 2800.7515 2818.2867 2842.1280 2966.0639 2973.5814 2976.9840 2982.5227 2983.4966 3001.3940 3015.2073 3017.7251 3029.3928 3039.2880 3041.9121 3050.6669 3061.1414 3067.0110 3077.2665 3083.6549 3096.8301 3128.9104 3141.7343 3154.3369 3166.5343 3178.4505
redmass: 4.5131 4.4814 3.2686 4.2345 4.4222 4.9761 2.6261 2.7137 3.9179 3.7002 2.2603 1.7975 1.8747 2.6102 2.6050 2.8982 2.2811 3.3321 1.8641 2.6053 2.8255 3.6766 4.4405 2.9821 4.1002 2.6402 4.8977 2.8104 1.7133 6.4325 5.6448 5.0819 2.4545 1.5946 1.9119 1.8812 2.1940 1.6637 1.7907 1.5785 1.2450 2.4686 2.1219 1.5224 3.5923 1.8216 1.4242 2.1784 6.1134 1.7580 1.3871 1.3233 1.3274 2.8430 1.9949 2.7226 2.8598 2.0691 2.1288 2.2748 2.5242 1.8642 1.6875 2.0508 2.4366 1.0567 1.2286 1.3055 1.7562 1.4108 1.6220 2.8059 1.2866 1.2175 1.1156 1.2207 1.2092 1.2861 1.3198 1.2624 1.4104 1.4658 1.5083 1.5824 1.3521 1.3637 1.3656 1.2369 10.2083 2.2552 1.0902 1.1081 1.0872 1.0816 1.0820 1.0867 1.0637 1.9576 1.1735 1.0977 1.0535 6.8282 6.2573 9.0551 1.0802 1.0721 1.0713 1.0616 1.0598 1.0570 1.0402 1.0609 1.0622 1.0796 1.0752 1.0964 1.1019 1.0874 1.1032 1.0926 1.0979 1.0972 1.0993 1.1079 1.0854 1.0891 1.0940 1.0980 1.0976
irintensity: 0.1592 1.0091 0.1141 0.3863 0.4976 1.1484 0.1031 0.3560 0.6078 0.4132 0.2885 0.4627 1.5265 0.2683 0.5651 23.3775 1.1471 3.4754 4.5938 2.3770 0.0140 0.3554 3.2488 0.7351 1.1540 1.8094 1.2207 2.0983 1.2306 0.5235 6.1913 17.5908 12.4049 93.0698 8.2457 0.7449 21.8067 0.7961 0.9065 2.0860 0.0336 1.3632 15.2163 7.8401 15.4694 3.3171 4.2294 0.6566 0.8826 6.9384 0.0727 5.0453 0.4689 90.3633 6.2258 144.8043 72.0570 6.7629 10.9642 52.3162 19.2202 9.6636 15.7432 8.7325 6.6380 0.0997 52.5944 3.5591 18.8294 43.9817 133.3804 214.1411 6.9071 10.5186 5.9172 4.1224 5.1838 4.2049 2.3847 13.3500 1.0261 0.4190 4.2468 8.5409 5.7689 4.0242 12.4690 8.9345 2.8336 15.3301 6.6603 13.6071 7.5896 4.4502 8.5752 8.5289 7.9889 3.9254 2.9674 19.8783 15.4539 41.5233 10.8579 136.0781 52.8199 93.5938 194.6672 40.8536 40.2844 18.9500 49.2335 25.3798 5.6448 39.9564 34.9468 62.9966 38.1617 26.3213 89.9849 16.6156 21.0532 49.3030 39.8312 32.8374 0.2797 12.1784 17.0627 22.2423 8.2844
temp: 298.150 k
press: 1.00000 atm
elementType: 8 8 7 6 6 6 6 6 6 6 6 6 6 6 6 6 6 6 6 6 1 1 1 1 1 1 1 1 1 1 1 1 1 1 1 1 1 1 1 1 1 1 1 1 1
symmnumber: 1
zpe: 1019034.0 jmol-1
zpe.correction: 0.388130 hartree
zpe.thermalcorrener: 0.408159 hartree
zpe.thermalcorrenthalpy: 0.409103 hartree
zpe.thermalcorrgfe: 0.336203 hartree
zpe.sumelectzpe: -866.465647 hartree
zpe.sumelectthermal: -866.445617 hartree
zpe.sumelectthermalent: -866.444673 hartree
zpe.sumelectthermalfe: -866.517573 hartree
dipole: -1.3530 1.3154 -0.9416
dipole: 2.1089
quadrupole: -106.9699 -120.0568 -118.5787
quadrupole: 11.1228 1.2532 1.0221
quadrupole: 8.2319 -4.8550 -3.3769 11.1228 1.2532 1.0221
hfenergy: -866.8537761 hartree
pointgroup: C01 [X(C17H25N1O2)]
dipole: -0.520976 0.4884366 -0.4224158 debye
polarizability: 226.6179741|24.6741129|183.7357083|21.0322163|-14.3688062|174.5799837 unknown
InChI: InChI=1S/C17H25NO2/c1-15-9-5-6-12-18(15)13-7-8-14-20-17(19)16-10-3-2-4-11-16/h2-4,10-11,15H,5-9,12-14H2,1H3
charge 0 multiplicity 1
45 atoms
O  1.713337 -0.833332 -0.945653
O  2.426877 -1.93142 0.987549
N  -3.507406 -0.269037 0.027726
C  -4.387513 0.402563 1.040581
C  -4.654468 1.865867 0.600908
C  -4.125885 -0.23783 -1.325893
C  -5.263247 1.959531 -0.813503
C  -4.36958 1.201086 -1.815811
C  -3.101878 -1.651723 0.396978
C  -3.766195 0.400137 2.454315
C  -1.874462 -2.167022 -0.393921
C  -0.635345 -1.261499 -0.214729
C  0.554447 -1.772508 -1.035135
C  2.575105 -1.014693 0.139145
C  3.677337 -0.007415 0.153647
C  4.642919 -0.094626 1.190091
C  3.7783 1.017112 -0.823327
C  5.701918 0.834111 1.248767
C  4.839902 1.944633 -0.760229
C  5.802444 1.8555 0.273733
H  -5.380793 -0.124031 1.086291
H  -3.690684 2.412528 0.62952
H  -5.328578 2.339015 1.341299
H  -5.100973 -0.796696 -1.328328
H  -3.454195 -0.758398 -2.031034
H  -6.277243 1.508213 -0.810624
H  -5.382141 3.018022 -1.114059
H  -3.394407 1.716774 -1.911407
H  -4.836571 1.173899 -2.819564
H  -3.949143 -2.374832 0.266306
H  -2.833014 -1.660773 1.466366
H  -4.325656 1.099416 3.102039
H  -3.794836 -0.588732 2.943935
H  -2.714793 0.738999 2.407263
H  -1.650533 -3.19268 -0.035594
H  -2.117078 -2.263181 -1.471398
H  -0.895163 -0.231906 -0.51942
H  -0.353691 -1.227086 0.854869
H  0.3241 -1.799885 -2.113781
H  0.883716 -2.769459 -0.689057
H  4.542889 -0.893038 1.93286
H  3.027093 1.073381 -1.615845
H  6.446354 0.764898 2.049307
H  4.918227 2.735539 -1.514193
H  6.625506 2.577676 0.319309
