program: Gaussian 09
title: 000046988
version: EM64L-G09RevD.01
frameworkgroup: C1[X(C8H14O3)]
method: RPBEPBE
basis: SDD
operation: Freq
keyword: #pfreq=noraman
keyword: PBEPBE/SDD
title: #p freq=noraman PBEPBE/SDD
converged: NO YES NO NO
title: Mulliken charges:
elementType: O O O C C C C C C C C H H H H H H H H H H H H H H
charge: -0.270027 -0.270964 -0.250508 -0.413147 -0.249697 -0.269598 -0.207580 -0.676418 0.254048 -0.208979 -0.474782 0.230631 0.230609 0.183296 0.183321 0.224062 0.224067 0.186227 0.186205 0.202357 0.228902 0.228905 0.253219 0.228847 0.247000
chargesum: 0.00000
title: Mulliken charges with hydrogens summed into heavy atoms:
elementType: O O O C C C C C C C C
charge: -0.270027 -0.270964 -0.250508 0.048094 0.116920 0.178531 0.164853 -0.016253 0.254048 0.044240 0.001065
polarizability: 1.53321060e+02 -1.59167033e+00 8.62492223e+01 7.04863891e-04 -4.90575906e-03 6.38794671e+01
1716.lowfreq: -13.4018 -0.0008 -0.0007 0.0007 1.5641 5.4434 25.0992 38.0390 54.5437
frequency: 21.6144 37.5704 54.5436 65.4218 96.5316 119.7127 132.0378 139.3420 205.0133 216.3523 238.7235 248.7389 309.7492 432.6769 441.5443 507.9807 517.1865 651.4217 776.6354 781.2318 814.3667 835.2657 844.2869 873.7461 944.2485 994.6163 1004.6052 1007.0209 1061.2717 1070.7273 1075.6861 1087.2502 1119.9791 1127.8105 1135.1273 1144.2862 1181.4374 1248.9684 1260.4120 1271.6611 1278.8471 1290.7430 1344.1999 1374.2106 1391.0687 1410.6770 1413.2854 1459.6658 1471.7151 1474.9702 1482.0024 1488.9142 1498.4638 1621.4613 1642.6087 2902.6171 2917.9596 2948.5938 2961.5246 2994.7876 2996.0034 3023.1179 3052.2953 3092.4208 3092.7241 3102.1129 3104.5476 3159.2697 3220.6818
redmass: 3.9554 2.1832 4.0329 3.3829 1.9834 2.6005 2.7125 4.1478 2.6959 5.1983 1.1620 3.7419 4.0951 3.6041 3.6011 1.7636 4.1076 3.8100 1.2736 2.2723 1.0853 3.2387 3.9944 1.1807 6.3424 1.4049 3.6140 1.0759 1.6689 3.2251 3.7235 3.0982 1.4895 2.5005 4.0766 1.4979 1.1756 1.1458 1.1797 1.0924 1.2768 1.4456 1.2504 1.4429 1.2523 1.3091 1.3916 1.0409 1.0755 1.0745 1.0617 1.0809 1.0819 11.3194 4.5512 1.0545 1.0547 1.1059 1.1067 1.0359 1.0573 1.0592 1.1060 1.0990 1.1055 1.1010 1.0599 1.0958 1.1158
irintensity: 1.2388 4.6539 1.4772 1.6429 2.1890 4.1721 3.2565 0.6859 5.6789 2.3712 1.0029 2.1428 5.6469 8.1790 18.4115 0.0379 0.7146 2.6610 16.0417 12.0541 4.5942 6.2170 10.0093 0.5021 59.5888 38.1334 14.1517 49.2143 13.0318 81.2638 150.5604 8.5731 0.1280 68.8904 346.2020 10.1929 1.0501 0.1159 0.0038 0.0023 2.9824 34.9255 27.9804 23.8988 39.0498 39.2617 23.6742 11.0667 2.3625 8.8570 8.3604 0.4320 7.7071 148.4164 19.1266 33.2225 112.6333 69.3848 58.3036 25.0878 17.4221 19.5007 9.6256 36.5314 44.0479 39.6840 4.5999 3.9329 8.2286
temp: 298.150 k
press: 1.00000 atm
elementType: 8 8 8 6 6 6 6 6 6 6 6 1 1 1 1 1 1 1 1 1 1 1 1 1 1
symmnumber: 1
zpe: 546144.9 jmol-1
zpe.correction: 0.208016 hartree
zpe.thermalcorrener: 0.221562 hartree
zpe.thermalcorrenthalpy: 0.222506 hartree
zpe.thermalcorrgfe: 0.165441 hartree
zpe.sumelectzpe: -537.996881 hartree
zpe.sumelectthermal: -537.983334 hartree
zpe.sumelectthermalent: -537.982390 hartree
zpe.sumelectthermalfe: -538.039455 hartree
dipole: -1.0255 -0.0387 0.0030
dipole: 1.0262
quadrupole: -54.4768 -69.5331 -67.0311
quadrupole: -13.3782 -0.0036 0.0009
quadrupole: 9.2035 -5.8528 -3.3507 -13.3782 -0.0036 0.0009
hfenergy: -538.2048964 hartree
pointgroup: C01[X(C8H14O3)]
dipole: 0.4035122 -0.0133955 -0.00096 debye
dipolederiv: -1.3256432 0.0451384 -0.0003954 0.0117214 -0.402614 -0.0000278 -0.0005019 0.0000861 -0.4240866 -1.841964 0.0980149 -0.000626 0.152289 -0.467579 -0.000089 -0.0005835 -0.0000768 -0.2844007 -0.7180277 -0.0281887 -0.0002118 0.1888487 -0.9020667 -0.0003794 0.0000226 -0.0005664 -0.325018 -0.166971 -0.0062189 -0.0000967 -0.030112 0.0410704 -0.0000141 -0.000151 -0.0000935 0.1173399 0.7451695 -0.1224711 0.0000436 -0.214011 0.3563497 -0.0000818 0.0003662 0.0000058 0.4609715 0.9083331 0.0811466 0.0003421 0.170406 0.2505799 -0.0000722 0.000279 -0.0000936 0.3676941 0.8540569 0.0855754 0.00012 0.3029353 0.3214727 0.0002348 -0.0000904 0.0001106 0.4486942 -0.1272861 0.0838588 -0.0001744 0.066287 0.0022601 0.0000842 -0.000148 0.0000814 0.055096 1.9884185 -0.0179835 0.0008079 -0.2327457 1.0783977 0.0005895 0.0006529 0.0007073 0.264482 -0.5053546 -0.2047081 -0.0003209 -0.1121235 0.0202556 0.0000812 -0.0002544 0.0000538 -0.1726702 0.0604233 0.0702307 0.000228 -0.08577 0.0679856 0.0002405 0.00013 0.0003291 -0.2931069 0.0825223 0.0003461 0.0011506 0.0059664 0.0045095 0.0929829 0.0035429 0.1034937 -0.048776 0.0823586 0.0002897 -0.0010984 0.0059408 0.0048344 -0.0929337 -0.0035098 -0.1034307 -0.0492343 -0.0373563 0.0016686 -0.020819 0.0711997 -0.081778 -0.1160425 0.0242554 -0.1537917 -0.1269234 -0.0373421 0.0012354 0.0211545 0.070775 -0.0817123 0.1160999 -0.0239589 0.1537584 -0.126905 -0.0457452 -0.0020002 0.0190293 -0.0622468 -0.0098243 -0.0812519 0.0006207 -0.0994748 -0.062567 -0.0456521 -0.0019472 -0.0191142 -0.0622752 -0.0102667 0.0813181 -0.000744 0.099564 -0.0620708 -0.0535853 0.0180761 -0.026842 -0.0871622 -0.0761399 0.1301313 0.0414342 0.157775 -0.128336 -0.0535773 0.0182633 0.0268774 -0.0871237 -0.0766811 -0.1303002 -0.0412286 -0.157849 -0.1278349 -0.161755 -0.0789709 -0.0000561 -0.107386 0.0306811 0.0000288 -0.0000233 0.0000403 0.1107225 0.1093354 -0.0132685 0.0285187 0.0376365 0.0031992 0.1074813 -0.0016168 0.1228373 -0.0665442 0.1093692 -0.0132074 -0.0283265 0.0377403 0.0027657 -0.1075761 0.0017056 -0.1229766 -0.0661252 0.0711383 0.0537821 -0.0000093 0.001252 -0.0532352 -0.000186 -0.0000314 -0.0001525 0.1803449 -0.0060246 -0.0875974 -0.0001596 -0.0974914 0.0054765 -0.0001777 -0.0001783 -0.0001822 0.1727714 0.1151592 0.0189357 -0.0000216 0.0554492 -0.0279409 -0.0001401 0.0000108 -0.0001548 0.1864828 unknown
polarizability: 153.3050733|1.8983249|86.2651713|0.0481107|0.0178703|63.8795046 unknown
InChI: InChI=1S/C8H14O3/c1-3-8(9)11-7-5-6-10-4-2/h3H,1,4-7H2,2H3
charge 0 multiplicity 1
25 atoms
O  3.302573 -0.312744 0.002636
O  -1.529779 -0.416898 -0.00042
O  -2.997647 1.403692 0.00047
C  0.890611 -0.303461 0.00008
C  2.14371 0.582117 0.001348
C  -0.386673 0.537637 0.00095
C  4.578226 0.419067 0.002641
C  5.7027 -0.615443 0.00417
C  -2.806977 0.161769 -0.000637
C  -3.84307 -0.902902 -0.001954
C  -5.166024 -0.596332 -0.002366
H  0.910624 -0.95785 0.889547
H  0.91073 -0.955908 -0.890796
H  2.164637 1.239071 0.901797
H  2.166586 1.239013 -0.899079
H  -0.469088 1.182373 0.896372
H  -0.468927 1.184717 -0.892793
H  4.636739 1.071847 -0.897641
H  4.635806 1.073496 0.901783
H  6.688621 -0.11592 0.004157
H  5.633792 -1.257774 0.898827
H  5.634634 -1.259483 -0.889324
H  -3.478621 -1.935243 -0.002586
H  -5.935126 -1.375389 -0.003376
H  -5.491057 0.450748 -0.001705
