program: Gaussian 16
title: Title Card Required
version: ES64L-G16RevC.01
frameworkgroup: C1[X(C18H17N3O6)]
method: RM062X
basis: 6-31+G(d,p)
operation: Freq
keyword: #N
keyword: Geom=AllCheck
keyword: Guess=TCheck
keyword: SCRF=Check
keyword: GenChk
keyword: RM062X/6-31+G(d,p)
keyword: Freq
converged: YES YES YES YES
title: Mulliken charges:
elementType: C C C C C N H H H H C H H C C H N O C O O C H H H H O H C N C O O C C C C H C H C H H H
charge: 0.149373 -0.678726 0.452961 0.062026 -0.114327 -0.147342 0.224493 0.212147 0.175213 0.201786 -0.521788 0.209981 0.200371 -0.423085 0.279462 0.189197 -0.439596 0.169869 0.171062 -0.356455 -0.196609 -0.100705 0.192969 0.184358 0.190567 0.384371 -0.412081 0.374723 -0.606670 -0.334436 0.600122 -0.389919 -0.306304 -0.524806 0.274868 0.405148 -0.234636 0.179890 -0.324328 0.186677 -0.092390 0.178548 0.179625 0.174395
chargesum: -0.00000
title: Mulliken charges with hydrogens summed into heavy atoms:
elementType: C C C C C N C C C N O C O O C O C N C O O C C C C C C
charge: 0.373867 -0.678726 0.654747 0.237239 0.097820 -0.147342 -0.111436 -0.423085 0.468659 -0.055225 0.169869 0.171062 -0.356455 -0.196609 0.467190 -0.037358 -0.606670 -0.334436 0.600122 -0.389919 -0.306304 -0.524806 0.454758 0.591825 -0.056088 -0.144702 0.082006
chargesum: 0.00000
1716.lowfreq: -315.6932 -6.9100 -1.8154 0.0009 0.0009 0.0013 14.1449 17.6788 24.7324
frequency: -315.6917 17.5536 24.6725 50.6547 64.7494 78.0794 84.5072 100.1965 114.2629 132.7100 141.1584 171.9651 179.1488 185.6580 210.0412 221.6610 231.3022 246.4934 258.2372 269.4834 311.5734 330.9738 352.2342 366.6926 374.9364 395.3182 398.2361 420.8653 423.0964 454.3819 470.5420 490.3687 509.9978 517.1543 545.0141 552.9454 587.4416 612.8922 622.6599 628.1545 651.1895 703.8956 718.8151 741.0368 749.7531 763.3762 771.7364 788.2337 805.9775 829.1674 833.2067 841.3509 857.4807 861.4205 869.3450 908.8379 925.0397 950.8633 974.6534 980.9520 995.3508 1000.9781 1019.6660 1021.5124 1030.1929 1044.8404 1055.9200 1076.2946 1104.4042 1115.8717 1134.2950 1166.3700 1173.5702 1177.2028 1182.3320 1185.3557 1192.0146 1205.1952 1220.3246 1222.6813 1261.3168 1267.2857 1276.7739 1299.8249 1319.0721 1330.0507 1332.6817 1343.1040 1350.3704 1362.0587 1365.9081 1399.8996 1423.1962 1443.8555 1458.2585 1469.0508 1479.5734 1489.8475 1493.1035 1501.1312 1501.4022 1541.4313 1577.2412 1679.6317 1685.5648 1744.7672 1824.1438 1852.1789 2338.7222 3036.8306 3095.7760 3096.5168 3105.1995 3156.5610 3166.7574 3183.3339 3219.2616 3220.7483 3225.3202 3228.9337 3237.2421 3243.8579 3249.0795 3271.1621 3490.8201 3871.1380
redmass: 10.7657 5.6175 4.2899 5.7941 6.8827 4.7626 7.6868 7.4268 7.3402 4.5383 4.8431 1.8462 2.4145 2.7504 3.2243 4.0323 2.3670 7.4357 3.0683 3.2295 5.8915 5.9150 5.7817 5.2193 5.7922 6.5287 5.2815 3.3202 3.9836 7.7713 6.8376 7.2630 3.7748 3.3582 8.1466 4.8892 6.8354 6.6824 6.4382 6.4643 6.8779 2.3505 4.1811 3.1276 2.4334 2.4772 4.3285 4.4858 5.8335 2.7529 5.5921 2.9028 1.2798 4.0397 1.9341 2.6679 2.6717 1.9416 4.1796 4.0327 1.2562 1.3629 4.1207 1.4295 3.0963 2.2350 2.0512 6.9803 1.4189 3.1093 2.7653 1.7905 1.1219 1.7980 1.2828 1.1723 1.7783 1.3191 1.3851 1.5000 2.0079 2.2954 1.4162 1.7113 1.9839 1.7150 2.0029 2.1225 3.1140 2.4110 4.0010 2.2318 2.3309 1.1705 3.2203 1.2695 3.2760 1.2549 1.0438 2.4268 1.0479 2.5385 1.2243 6.3263 6.9048 7.0706 10.2776 12.6388 12.6600 1.0833 1.0644 1.0313 1.0839 1.1028 1.0893 1.1073 1.1072 1.0865 1.0903 1.0903 1.0939 1.0975 1.0974 1.0954 1.0760 1.0659
irintensity: 127.7993 0.2076 0.7693 1.8708 0.5184 1.4327 0.7483 0.8677 6.6281 3.8022 1.2408 3.4574 0.4807 8.2155 12.8878 6.3797 29.5906 19.6448 9.0482 29.9601 0.1383 29.3227 0.7850 6.2075 7.8038 19.7744 5.2375 4.4736 7.7380 8.5505 13.4265 21.4218 8.5041 10.2321 19.4757 3.2466 6.0591 15.5722 0.1499 1.1962 18.3258 28.0942 40.7640 12.9325 99.8288 50.4411 62.8978 21.4194 36.2890 43.7781 26.2105 16.0173 4.5039 48.3805 106.4546 33.8942 14.5439 6.0763 52.4159 25.4071 1.6216 0.2395 11.9922 1.4341 5.2975 35.5701 11.8494 64.2189 12.0023 33.4107 50.0970 26.3775 0.7575 111.7979 2.0648 30.2895 18.1242 122.7716 26.9739 17.0662 268.3421 398.4276 17.3095 173.0165 113.2108 25.6178 280.2843 295.9306 45.3341 368.7607 713.4465 44.8718 89.9593 27.5131 163.0172 8.8823 142.5380 61.2322 14.9728 5.6690 14.3333 65.9832 40.1792 22.8491 8.9275 63.2063 231.9359 639.8155 259.2579 18.7654 19.1629 25.1386 9.0918 10.8005 0.6727 11.2520 7.1908 0.2463 4.9372 6.6689 13.0084 5.0899 0.7214 15.4802 154.8822 83.4845
temp: 298.150 k
press: 1.00000 atm
elementType: 6 6 6 6 6 7 1 1 1 1 6 1 1 6 6 1 7 8 6 8 8 6 1 1 1 1 8 1 6 7 6 8 8 6 6 6 6 1 6 1 6 1 1 1
symmnumber: 1
zpe: 894260.6 jmol-1
zpe.correction: 0.340606 hartree
zpe.thermalcorrener: 0.363345 hartree
zpe.thermalcorrenthalpy: 0.364289 hartree
zpe.thermalcorrgfe: 0.287950 hartree
zpe.sumelectzpe: -1310.810700 hartree
zpe.sumelectthermal: -1310.787960 hartree
zpe.sumelectthermalent: -1310.787016 hartree
zpe.sumelectthermalfe: -1310.863356 hartree
dipole: -0.4055 5.9176 2.5896
dipole: 6.4721
quadrupole: -135.0350 -174.2439 -152.8348
quadrupole: -28.3431 -10.8702 -3.5664
quadrupole: 19.0029 -20.2060 1.2031 -28.3431 -10.8702 -3.5664
hfenergy: -1311.1513054 hartree
pointgroup: C01 [X(C18H17N3O6)]
dipole: 2.2334485 0.300961 -1.1853102 debye
polarizability: 279.2609648|5.3712408|335.0270124|8.5259702|31.239677|261.2005867 unknown
InChI: InChI=1S/C18H17N3O6/c1-25-17(23)15-14(22)9-11-7-8-21(16(27-20-15)13(11)10-19)18(24)26-12-5-3-2-4-6-12/h2-8,11,14,16,20,22H,9H2,1H3
charge 0 multiplicity 1
44 atoms
C  -1.37204688 1.73584944 -0.15047242
C  -1.45971169 0.38505138 -0.67546
C  -0.60060306 -0.35385304 -1.65220652
C  0.56854491 0.52744629 -1.98753907
C  0.70766939 1.77047705 -1.5125329
N  -0.18463467 2.402967 -0.61220267
H  -2.26260628 2.36110681 -0.2197711
H  1.54656682 2.40240983 -1.77568478
H  1.32685265 0.15627616 -2.66997724
H  -1.14609498 -0.58444701 -2.57892883
C  -0.27578197 -1.72777899 -0.96285455
H  -1.08496595 -2.43870604 -1.16320949
H  0.64321483 -2.1520613 -1.37462588
C  0.2172156 -0.13099554 0.86879682
C  -0.17855481 -1.57407875 0.59010727
H  0.63711244 -2.21541874 0.94019646
N  -0.2418057 0.83980947 1.69943096
O  -1.39766667 1.49781632 1.38419136
C  1.71723829 0.11439357 0.66837792
O  2.27996043 1.10420943 1.08493953
O  2.33291427 -0.87885316 0.04119895
C  3.72461674 -0.66473808 -0.23949539
H  4.28379989 -0.55567136 0.69131023
H  4.05133884 -1.54899116 -0.78353666
H  3.84625047 0.23367998 -0.84943096
H  0.48948177 1.51957479 1.91373458
O  -1.29408636 -1.9996337 1.31948118
H  -2.11957128 -1.62876187 0.98381132
C  -2.74090305 -0.19982308 -0.44880078
N  -3.76465183 -0.72762056 -0.28323818
C  0.07325216 3.72747887 -0.28734165
O  1.04133345 4.34560687 -0.65545935
O  -0.91256634 4.20970041 0.49633904
C  -0.81543453 5.52353736 0.95942365
C  -0.79065553 6.59257039 0.07272144
C  -0.82853023 5.70480463 2.3350512
C  -0.76660625 7.88499783 0.59150027
H  -0.78256914 6.41402224 -0.99689428
C  -0.80907792 7.00410567 2.83987567
H  -0.86013405 4.83825157 2.9874355
C  -0.77584895 8.09348895 1.97101801
H  -0.74258446 8.73140545 -0.08741611
H  -0.82089462 7.16127808 3.9136471
H  -0.75932446 9.10379954 2.36691624
