program: Gaussian 09
title: 000046977
version: EM64L-G09RevD.01
frameworkgroup: C1[X(C13H21N2O2)]
method: RPBEPBE
basis: SDD
operation: Freq
keyword: #p
keyword: freq=noraman
keyword: PBEPBE/SDD
title: #p freq=noraman PBEPBE/SDD
converged: YES YES NO NO
title: Mulliken charges:
elementType: O O N N C C C C C C C C C C C C C H H H H H H H H H H H H H H H H H H H H H
charge: -0.329925 -0.283168 -0.230509 -0.136376 0.318899 -0.601423 -0.580369 -0.561897 0.361902 -0.288751 -0.461471 -0.462959 -0.832543 0.393596 0.321045 -0.602649 -0.611059 0.272665 0.262594 0.282369 0.280342 0.253699 0.300281 0.269304 0.256101 0.278045 0.258562 0.326970 0.277435 0.283630 0.258378 0.208895 0.279557 0.242588 0.242367 0.241798 0.269270 0.242801
chargesum: 1.00000
title: Mulliken charges with hydrogens summed into heavy atoms:
elementType: O O N N C C C C C C C C C C C C C
charge: -0.329925 -0.283168 -0.230509 -0.136376 0.318899 0.216205 0.253953 0.241554 0.361902 -0.030189 -0.134500 -0.185524 -0.081639 0.393596 0.321045 0.161864 0.142810
polarizability: 2.45122591e+02 -5.90518832e+00 1.55946123e+02 -4.62666587e-01 -7.42315588e-01 9.81002787e+01
1716.lowfreq: -8.9285 -0.0005 -0.0004 0.0008 0.9931 6.5084 15.7008 33.1285 72.4242
frequency: 14.7135 33.0079 72.4141 80.6602 92.1027 97.0244 116.3226 128.2512 148.4030 175.2932 202.9133 215.5582 230.6623 243.6016 256.3015 267.4706 283.5796 323.3947 357.6936 362.1012 387.2055 389.4094 398.5734 438.1493 443.7052 482.8148 490.9742 544.8063 566.3527 585.0405 611.5137 664.6902 667.3547 711.5640 716.0100 780.7859 812.0448 816.3377 915.7460 921.3694 921.9028 926.8238 953.0628 974.2187 1015.3386 1038.9529 1041.1979 1044.8573 1056.1118 1096.0302 1097.5495 1104.1364 1107.1499 1146.2799 1149.0857 1187.9748 1211.7224 1217.7816 1227.1218 1242.6497 1248.8496 1309.1998 1366.2284 1376.6394 1395.0296 1405.7350 1418.6406 1419.1651 1427.4278 1439.1659 1447.9160 1454.2600 1462.5035 1466.4299 1471.4872 1471.6381 1474.5667 1484.3618 1487.0175 1487.6372 1494.0320 1497.5869 1503.4655 1514.4834 1584.7387 1606.3946 1697.9051 2986.4615 2989.3742 2991.0123 3033.2209 3035.1937 3039.8522 3061.8302 3071.5361 3074.9548 3104.6680 3137.9328 3142.4914 3143.5133 3149.8531 3162.6434 3163.6033 3176.0769 3182.0708 3189.2928 3196.0506 3201.3103
redmass: 4.0031 4.0218 1.2859 2.3303 2.8103 3.9498 1.3737 2.4647 1.1113 1.2389 2.8363 3.5157 2.8723 1.7434 1.6908 2.9391 2.8054 2.9815 1.3296 3.0770 2.7513 2.7301 3.1767 3.0778 2.7698 3.3429 3.2783 4.5427 3.9196 3.1797 5.2385 5.4119 10.5910 4.8245 5.2444 6.9135 3.5151 1.4173 2.7817 1.4135 3.5832 3.0708 1.3444 2.4902 1.9323 1.4713 1.2444 4.2275 1.4222 1.2205 1.3412 1.3186 2.2629 1.5502 1.3741 1.6121 1.8419 1.6416 4.0977 2.4833 2.7114 1.5304 3.3801 5.3358 3.2434 1.2274 1.1617 1.1438 1.1461 1.1830 1.0912 1.1412 1.2000 1.0482 1.0645 1.1196 1.0411 1.0880 1.0440 1.3719 1.1057 1.1502 1.1279 1.0770 7.1768 6.1203 8.5229 1.0376 1.0428 1.0366 1.0335 1.0333 1.0351 1.1020 1.1025 1.0924 1.0980 1.0990 1.1047 1.1053 1.1046 1.1061 1.0959 1.0902 1.1020 1.0927 1.1011 1.0942
irintensity: 2.4002 5.5071 0.4808 0.0076 1.3870 4.4836 0.0425 0.0698 0.6405 0.0949 1.9498 0.1977 0.1626 0.9336 1.2960 3.8096 0.0615 1.1257 3.3259 21.3341 1.9632 1.8002 1.3224 4.1796 3.7563 11.1664 0.9093 0.5405 2.2745 9.3753 10.7700 4.9787 16.0528 10.4973 22.0870 23.3746 61.7133 31.1943 10.2137 26.6828 3.0869 27.9818 0.3077 74.9811 84.3085 10.6816 1.0186 5.8481 39.9473 1.5688 19.2173 1.6696 736.6558 2.8206 0.0254 47.0702 0.1330 13.0295 103.9505 6.1098 59.1537 82.1816 156.5902 1.6485 3.2215 13.4563 13.4348 18.2038 27.1262 10.0981 5.9948 7.3001 42.2931 4.2994 12.2824 15.9889 0.0843 36.6942 48.4128 144.9141 90.6990 34.8006 45.1973 11.3389 8.6709 140.3573 395.1962 23.8859 26.4396 76.7125 5.1460 3.3927 14.1569 26.2789 20.0274 18.7092 19.0364 1.2347 0.4684 0.1943 19.2128 2.5844 4.3296 1.1149 1.7899 21.5828 1.4542 2.4484
temp: 298.150 k
press: 1.00000 atm
elementType: 8 8 7 7 6 6 6 6 6 6 6 6 6 6 6 6 6 1 1 1 1 1 1 1 1 1 1 1 1 1 1 1 1 1 1 1 1 1
symmnumber: 1
zpe: 852048.1 jmol-1
zpe.correction: 0.324528 hartree
zpe.thermalcorrener: 0.343591 hartree
zpe.thermalcorrenthalpy: 0.344535 hartree
zpe.thermalcorrgfe: 0.276676 hartree
zpe.sumelectzpe: -766.367529 hartree
zpe.sumelectthermal: -766.348466 hartree
zpe.sumelectthermalent: -766.347522 hartree
zpe.sumelectthermalfe: -766.415381 hartree
dipole: -10.4236 -2.5396 -0.2788
dipole: 10.7322
quadrupole: 0.4043 -87.6197 -97.6374
quadrupole: -4.2422 -1.0242 -0.9898
quadrupole: 62.0219 -26.0021 -36.0198 -4.2422 -1.0242 -0.9898
hfenergy: -766.6920568 hartree
pointgroup: C01 [X(C13H21N2O2)]
dipole: -4.0434841 1.1443008 0.411192 debye
polarizability: 245.343194|-0.5709575|149.1855582|4.8916474|18.0487306|104.6402408 unknown
InChI: InChI=1S/C13H21N2O2/c1-10-9-11(17-13(16)14(2)3)7-8-12(10)15(4,5)6/h7-9H,1-6H3
charge 1 multiplicity 1
38 atoms
O  2.13786 0.408925 0.242511
O  2.715834 -1.696577 -0.715521
N  -3.619608 0.342283 -0.005975
N  4.353911 -0.211304 0.076365
C  -2.079946 0.259005 0.050105
C  -4.164363 1.649169 0.583729
C  -4.26482 -0.786486 0.811904
C  -4.091267 0.296907 -1.467812
C  -1.371882 -0.925029 -0.32503
C  -1.372646 1.417633 0.454587
C  0.046485 -0.886523 -0.271582
C  0.028798 1.431234 0.503279
C  -1.953082 -2.274949 -0.745107
C  0.749198 0.271399 0.137978
C  3.076705 -0.617011 -0.185276
C  5.463103 -1.11282 -0.301506
C  4.737478 1.068028 0.703745
H  -3.816409 2.504675 -0.01102
H  -5.262872 1.601126 0.537878
H  -3.841072 1.745656 1.629853
H  -3.873209 -0.734487 1.83838
H  -5.356427 -0.641474 0.810213
H  -4.02212 -1.757445 0.370204
H  -3.75545 -0.6340 -1.937838
H  -5.191011 0.356278 -1.491896
H  -3.648568 1.152918 -1.997565
H  -1.884119 2.336194 0.743895
H  0.615549 -1.771571 -0.560514
H  0.570193 2.327076 0.817349
H  -1.1914 -2.836664 -1.308315
H  -2.206018 -2.892695 0.137833
H  -2.845253 -2.228773 -1.391111
H  5.054519 -2.020291 -0.767991
H  6.04487 -1.393692 0.595226
H  6.134532 -0.60502 -1.017526
H  5.32564 0.871889 1.619219
H  3.846575 1.649762 0.966864
H  5.362189 1.656353 0.006268
