program: Gaussian 09
title: 000046952
version: EM64L-G09RevD.01
frameworkgroup: C1[X(C14H23N2O2)]
method: RPBEPBE
basis: SDD
operation: Freq
keyword: #p
keyword: freq=noraman
keyword: PBEPBE/SDD
title: #p freq=noraman PBEPBE/SDD
converged: NO YES NO NO
title: Mulliken charges:
elementType: O O N N C C C C C C C C C C C C C C H H H H H H H H H H H H H H H H H H H H H H H
charge: -0.326709 -0.261143 -0.220597 -0.362336 -0.328334 -0.323600 0.345438 -0.638559 0.387458 -0.695707 -0.705116 -0.296796 -0.493324 -0.849138 -0.466400 0.382523 0.307698 -0.600990 0.254947 0.288432 0.272457 0.263429 0.266596 0.267449 0.281876 0.262337 0.256294 0.238689 0.245861 0.269470 0.245994 0.259373 0.323772 0.281779 0.254982 0.217056 0.279126 0.345362 0.248148 0.274172 0.248031
chargesum: 1.00000
title: Mulliken charges with hydrogens summed into heavy atoms:
elementType: O O N N C C C C C C C C C C C C C C
charge: -0.326709 -0.261143 -0.220597 -0.016974 0.215045 0.212286 0.345438 0.177361 0.387458 0.061613 0.056209 -0.037423 -0.169552 -0.095321 -0.187275 0.382523 0.307698 0.169362
polarizability: 2.54293683e+02 5.52315846e+00 1.59682883e+02 -1.22259181e+00 -2.49874709e+00 1.16465474e+02
1716.lowfreq: -23.8659 -3.2584 0.0005 0.0006 0.0007 6.0811 20.9411 30.6252 49.8482
frequency: 20.2159 30.5888 49.6289 77.2956 80.8102 87.8961 101.6366 103.6380 167.7116 171.0478 190.1356 211.4939 215.7577 223.4650 232.2379 246.0839 273.6306 305.4603 327.7148 335.9298 339.9228 358.5153 387.5257 401.6764 413.7852 457.7910 489.0067 499.5138 546.7704 579.1041 583.9631 618.4077 647.7977 669.6050 677.7235 710.7793 733.3946 770.8531 785.3691 805.1835 815.2203 842.4603 854.2006 920.2839 934.5979 951.7202 953.9876 1004.7479 1007.2083 1013.0638 1041.3403 1049.1703 1060.7744 1072.0680 1094.9719 1105.2635 1125.4835 1140.0117 1149.3175 1160.2078 1176.2519 1186.0539 1193.9313 1205.4057 1244.8432 1284.9079 1303.3454 1314.7721 1358.1699 1363.2723 1374.6939 1397.4269 1405.5266 1410.9917 1412.1581 1430.5404 1436.2586 1457.1033 1459.5630 1464.3965 1469.5188 1476.0648 1481.6236 1481.8366 1482.8586 1489.0292 1492.8248 1496.9340 1501.0909 1510.6628 1513.1606 1585.2046 1608.4133 1728.8709 2985.3119 2998.9479 3005.5091 3006.2620 3042.7730 3047.4951 3057.7888 3064.4320 3085.2437 3093.8431 3095.3816 3101.2563 3105.6522 3109.7075 3128.0714 3134.2979 3145.2198 3154.5981 3165.0452 3176.0262 3188.6427 3197.9859 3568.2587
redmass: 5.2662 3.7866 3.4093 2.6507 3.4666 1.1199 1.9763 2.9535 2.7821 3.0687 1.4474 2.3382 1.2626 3.2930 2.2931 3.4129 1.3746 2.5409 3.5595 1.7320 2.5999 2.9091 2.5189 2.8738 3.5436 2.7932 3.2588 3.0781 4.7766 3.5510 3.1636 1.1441 4.4130 6.6566 11.2255 3.9379 5.4750 1.9695 1.3282 1.4363 1.4150 2.1866 4.3611 1.3627 2.6163 1.3410 3.6048 1.7659 2.2155 2.1130 1.5383 3.2905 5.6013 1.6679 1.9443 1.5865 1.2886 1.7016 1.7582 1.8841 1.8536 1.8777 1.8475 1.5159 3.2737 1.1338 1.3181 1.3612 1.2919 1.3371 5.4374 3.0983 1.2120 1.2007 1.1980 1.1501 1.1592 1.3169 1.2353 1.0634 1.0697 1.1110 1.0638 1.1321 1.0498 1.3516 1.0813 1.0540 1.0632 1.1450 1.3780 7.3277 5.9839 9.7046 1.0409 1.0348 1.0374 1.0376 1.0340 1.0645 1.0661 1.0961 1.1033 1.0970 1.0989 1.0966 1.1004 1.0989 1.1000 1.1025 1.1006 1.1040 1.1050 1.0897 1.0927 1.0950 1.0775
irintensity: 3.1011 5.8587 1.1698 0.1476 0.8797 0.6414 0.5088 4.1843 0.8750 0.3702 0.1309 0.1769 0.4762 0.6596 2.2298 1.8635 0.4177 1.3599 8.6642 0.7574 15.4866 1.0399 1.4830 3.6271 5.2075 8.1325 1.9686 3.6831 0.2724 4.9988 2.1140 134.7992 2.9278 9.0667 33.3308 0.3987 7.8655 11.6081 14.4010 9.2610 20.1124 34.1532 105.5057 23.4563 14.2393 0.3999 24.7603 9.5238 32.9276 37.6499 16.8890 126.0271 248.4522 1.5657 9.0477 0.3804 0.1247 105.9540 122.8244 99.9317 118.2591 65.7567 28.6091 38.0186 80.0341 1.0129 28.9671 34.3630 9.4938 2.5892 13.5661 19.8468 14.1289 27.0874 40.2929 15.4953 32.9673 158.7252 41.4728 11.4984 23.1938 42.8376 23.6082 38.5413 24.1614 163.3253 7.0842 4.7185 28.6080 42.5329 128.7179 2.4683 114.4560 289.5491 24.7848 47.3208 4.5487 5.1703 2.1874 4.2926 14.1376 19.6764 20.9517 8.0936 6.3407 12.2948 9.0467 17.0743 2.7743 8.5046 5.8344 9.9251 3.7667 1.1167 17.4985 2.0684 66.4373
temp: 298.150 k
press: 1.00000 atm
elementType: 8 8 7 7 6 6 6 6 6 6 6 6 6 6 6 6 6 6 1 1 1 1 1 1 1 1 1 1 1 1 1 1 1 1 1 1 1 1 1 1 1
symmnumber: 1
zpe: 927588.1 jmol-1
zpe.correction: 0.353300 hartree
zpe.thermalcorrener: 0.373450 hartree
zpe.thermalcorrenthalpy: 0.374395 hartree
zpe.thermalcorrgfe: 0.304078 hartree
zpe.sumelectzpe: -805.605403 hartree
zpe.sumelectthermal: -805.585253 hartree
zpe.sumelectthermalent: -805.584308 hartree
zpe.sumelectthermalfe: -805.654625 hartree
dipole: 7.7207 -2.4031 -0.0151
dipole: 8.0860
quadrupole: -19.3150 -93.8890 -100.4489
quadrupole: 7.6379 -1.5101 0.1620
quadrupole: 51.9026 -22.6713 -29.2313 7.6379 -1.5101 0.1620
hfenergy: -805.958703 hartree
pointgroup: C01 [X(C14H23N2O2)]
dipole: 2.9946771 -0.765996 -0.7522028 debye
polarizability: 254.1196197|-5.2663408|133.051831|6.4009382|20.7502908|143.2705896 unknown
InChI: InChI=1S/C14H23N2O2/c1-6-16(5,7-2)13-9-8-12(10-11(13)3)18-14(17)15-4/h8-10,15H,6-7H2,1-5H3
charge 1 multiplicity 1
41 atoms
O  -2.886392 -0.349169 -0.667709
O  -3.59048 1.169784 1.053253
N  2.853745 -0.395252 -0.145195
N  -5.087606 0.103228 -0.417419
C  3.426057 -0.648279 1.284367
C  3.348241 0.982812 -0.707466
C  1.313845 -0.362233 -0.169483
C  3.425142 -1.494791 -1.04256
C  0.552396 0.45931 0.721336
C  2.835142 -1.878347 1.9793
C  4.866993 1.185935 -0.74637
C  0.656171 -1.123105 -1.167023
C  -0.859055 0.46947 0.565171
C  1.069508 1.314763 1.876615
C  -0.739697 -1.099028 -1.304088
C  -1.507236 -0.295938 -0.432543
C  -3.866383 0.404742 0.103462
C  -6.330589 0.684118 0.11175
H  4.51514 -0.755155 1.153976
H  3.245267 0.263593 1.866819
H  2.908283 1.04563 -1.71728
H  2.86832 1.752876 -0.086715
H  3.225745 -1.260932 -2.097605
H  4.511125 -1.536826 -0.881855
H  2.979474 -2.461479 -0.774171
H  3.252585 -1.927136 3.00056
H  1.737947 -1.821999 2.06774
H  3.100892 -2.824282 1.478737
H  5.388169 0.470902 -1.403823
H  5.050981 2.192232 -1.163501
H  5.334106 1.166462 0.252293
H  1.206457 -1.755453 -1.864296
H  -1.464517 1.083667 1.233616
H  0.268648 1.991399 2.212815
H  1.343205 0.694833 2.751265
H  1.934645 1.954942 1.631123
H  -1.239193 -1.690154 -2.07567
H  -5.121178 -0.548872 -1.202567
H  -6.848058 1.274276 -0.66465
H  -6.075864 1.348167 0.951624
H  -7.007683 -0.108015 0.476067
