program: Gaussian 09
title: 000046918
version: EM64L-G09RevD.01
frameworkgroup: C1[X(C14H21N2)]
method: RPBEPBE
basis: SDD
operation: Freq
keyword: #p
keyword: freq=noraman
keyword: PBEPBE/SDD
title: #p freq=noraman PBEPBE/SDD
converged: NO YES NO NO
title: Mulliken charges:
elementType: N N C C C C C C C C C C C C C C H H H H H H H H H H H H H H H H H H H H H
charge: -0.130870 0.066839 -0.183610 -0.321005 -0.301816 -0.320613 0.446765 -0.693135 -0.704184 -0.705563 -0.234546 -0.408809 -0.342757 -0.222692 -0.233951 -0.213317 0.308217 0.286423 0.254103 0.285011 0.248205 0.294908 0.267549 0.263892 0.248502 0.253557 0.269638 0.245170 0.239732 0.273583 0.240214 0.249980 0.244662 0.250361 0.257871 0.258202 0.263482
chargesum: 1.00000
title: Mulliken charges with hydrogens summed into heavy atoms:
elementType: N N C C C C C C C C C C C C C C
charge: -0.130870 0.066839 0.124607 0.219521 0.231401 0.241843 0.446765 0.072817 0.050357 0.058214 -0.234546 -0.164147 -0.092396 0.035179 0.024251 0.050165
polarizability: 1.86833784e+02 9.07405253e+00 1.55851077e+02 -1.03552938e+01 1.02239505e+01 1.24150525e+02
1716.lowfreq: -9.3161 -0.0007 -0.0007 -0.0004 7.7799 13.7958 46.2587 72.2566 77.5914
frequency: 45.7769 72.1755 77.5772 98.6779 114.2105 127.9983 141.4062 149.2848 190.6635 217.8467 239.1364 245.7370 252.0405 277.5177 328.1479 336.0324 344.4301 361.4920 375.1799 405.0840 422.6382 441.0934 481.4111 510.0372 571.9916 613.6263 632.4620 694.1780 708.9343 715.7644 772.2332 781.0852 807.1298 822.2841 835.0888 859.2782 876.1776 893.0522 942.9430 989.1708 990.1524 995.5856 1012.5350 1016.9263 1021.3850 1030.3870 1032.7846 1075.0179 1090.0150 1105.2850 1108.9062 1152.8298 1161.1745 1175.7706 1186.3130 1193.6349 1200.9288 1252.1243 1285.6168 1293.3638 1300.5084 1336.0248 1341.9323 1358.5384 1373.2492 1380.5120 1389.8704 1414.6114 1418.5890 1420.1092 1445.4611 1464.9329 1468.2187 1474.2809 1479.0523 1480.5969 1482.1317 1486.3606 1491.2396 1494.9430 1498.7228 1590.1778 1604.4498 2199.7653 3005.3328 3009.7630 3011.8385 3033.9537 3038.7747 3041.2721 3045.4829 3093.9246 3095.3442 3095.4193 3097.9382 3099.3997 3103.7681 3120.5848 3123.1562 3124.1277 3130.8758 3137.6615 3154.9105 3166.4774 3181.3957
redmass: 3.6613 3.2117 4.3877 2.2604 2.4200 2.4884 3.1896 4.4458 3.1034 1.4496 1.9126 1.4111 1.8271 2.2470 2.8153 2.7405 2.0372 3.0412 4.6662 2.8332 3.1456 5.8424 3.1205 4.1653 2.7955 6.4337 5.9275 3.6703 1.9427 2.1756 1.5160 1.5172 1.4798 2.4666 1.4309 1.2488 2.3240 2.2228 1.4177 1.9098 2.5587 3.8355 2.0508 1.3621 2.0662 2.1886 2.9130 1.9273 1.6952 1.8929 2.1416 1.8960 1.8440 1.8200 1.0684 1.6471 1.2687 1.3782 1.3026 1.1787 1.1480 1.1705 1.2834 1.2542 1.2726 1.3673 5.5401 1.2094 1.1928 1.1847 2.0792 1.0643 1.0725 1.0643 1.1305 1.2124 1.4331 1.0824 1.0597 1.0579 1.0675 5.8232 5.8839 12.5868 1.0376 1.0380 1.0390 1.0809 1.0618 1.0611 1.0619 1.0992 1.0983 1.0976 1.1018 1.1016 1.1019 1.1036 1.0914 1.1025 1.1008 1.0896 1.0900 1.0954 1.1014
irintensity: 0.1675 0.4206 0.7715 2.6236 0.4285 0.2960 2.8493 2.2330 1.0266 1.4521 0.6225 0.9488 0.9717 0.4022 0.1641 0.0776 0.4818 0.0283 2.3621 0.2076 1.2789 4.6560 0.1787 2.9405 0.4065 0.4683 17.0846 1.8094 20.9926 156.1045 37.0599 7.9605 5.2252 13.0261 1.8704 0.1511 4.8856 2.1042 0.7241 2.2827 5.1493 8.4855 19.8859 0.5639 17.5782 0.4111 22.4167 2.1782 12.7884 4.9482 0.6750 9.5390 5.1841 9.9902 0.6748 31.9061 4.7982 8.6276 3.7103 8.2965 4.4914 1.3945 2.1086 1.4546 3.6107 0.6264 0.4548 18.1022 44.1842 28.9749 14.6358 10.7977 0.5655 38.8404 32.6263 5.6691 25.3827 7.8182 8.6328 7.3168 6.9278 2.0305 7.5711 2.4252 3.6958 4.7394 3.3135 1.6347 8.0986 3.2658 5.2360 4.9860 6.4486 4.9545 5.3882 3.7265 2.1931 18.3173 1.6635 21.6195 14.4565 1.9527 1.1135 6.9337 4.8594
temp: 298.150 k
press: 1.00000 atm
elementType: 7 7 6 6 6 6 6 6 6 6 6 6 6 6 6 6 1 1 1 1 1 1 1 1 1 1 1 1 1 1 1 1 1 1 1 1 1
symmnumber: 1
zpe: 846103.2 jmol-1
zpe.correction: 0.322264 hartree
zpe.thermalcorrener: 0.339202 hartree
zpe.thermalcorrenthalpy: 0.340146 hartree
zpe.thermalcorrgfe: 0.278826 hartree
zpe.sumelectzpe: -654.094957 hartree
zpe.sumelectthermal: -654.078018 hartree
zpe.sumelectthermalent: -654.077074 hartree
zpe.sumelectthermalfe: -654.138394 hartree
dipole: 2.9397 -4.5143 2.0213
dipole: 5.7538
quadrupole: -59.4053 -91.0237 -85.7899
quadrupole: -1.9585 -1.2533 9.1689
quadrupole: 19.3343 -12.2841 -7.0503 -1.9585 -1.2533 9.1689
hfenergy: -654.4172202 hartree
pointgroup: C01 [X(C14H21N2)]
dipole: 1.0446435 -1.8119649 0.8660215 debye
polarizability: 187.3885579|6.3628589|155.7727908|-11.7944686|9.0520962|123.6740371 unknown
InChI: InChI=1S/C14H21N2/c1-4-16(5-2,6-3)14(12-15)13-10-8-7-9-11-13/h7-11,14H,4-6H2,1-3H3
charge 1 multiplicity 1
37 atoms
N  1.337143 -0.385185 0.196848
N  0.825862 2.749929 -1.455461
C  0.252362 0.225532 -0.826739
C  1.127786 0.132611 1.648909
C  1.103866 -1.924615 0.200751
C  2.768831 -0.041229 -0.286223
C  -1.198108 0.05024 -0.392848
C  1.533051 1.583765 1.940613
C  2.148195 -2.760017 0.95204
C  3.150897 -0.596614 -1.663857
C  0.587918 1.627064 -1.13327
C  -1.930176 -1.070025 -0.868391
C  -1.852152 1.017582 0.416213
C  -3.283897 -1.24097 -0.508588
C  -3.205376 0.844486 0.773584
C  -3.921671 -0.287576 0.318909
H  0.42814 -0.361032 -1.747258
H  0.060588 -0.033377 1.869922
H  1.717948 -0.548296 2.282926
H  0.099566 -2.071913 0.630217
H  1.070191 -2.231658 -0.857797
H  2.840143 1.05724 -0.286238
H  3.442987 -0.42398 0.498102
H  1.278456 1.781547 2.99736
H  2.616233 1.758829 1.836642
H  0.997851 2.328353 1.332241
H  1.842228 -3.81788 0.863955
H  3.159704 -2.682209 0.520877
H  2.201239 -2.538545 2.030479
H  4.193687 -0.293504 -1.864259
H  3.119989 -1.697553 -1.718284
H  2.543736 -0.174938 -2.482629
H  -1.456635 -1.79731 -1.5396
H  -1.322351 1.920879 0.740585
H  -3.843161 -2.102991 -0.885022
H  -3.705167 1.597931 1.39013
H  -4.974405 -0.41497 0.59026
