program: Gaussian 09
title: 000048094
version: EM64L-G09RevD.01
frameworkgroup: C1[X(C21H33NO3)]
method: RPBEPBE
basis: SDD
operation: Freq
keyword: #p
keyword: freq=noraman
keyword: PBEPBE/SDD
title: #p freq=noraman PBEPBE/SDD
converged: YES YES NO NO
title: Mulliken charges:
elementType: O O O N C C C C C C C C C C C C C C C C C C C C C H H H H H H H H H H H H H H H H H H H H H H H H H H H H H H H H H
charge: -0.262922 -0.237566 -0.266235 -0.092054 -0.068761 -0.404205 -0.369219 -0.414917 -0.390118 -0.342963 -0.739276 -0.401756 -0.269982 0.278485 -0.682466 0.479182 -0.381518 -0.320761 -0.442705 -0.291850 -0.342841 0.345890 -0.388017 -0.348815 -0.686538 0.212023 0.208134 0.188073 0.178691 0.203003 0.212218 0.196085 0.191364 0.204126 0.206566 0.170980 0.218470 0.227115 0.220345 0.227870 0.210835 0.218630 0.225973 0.251759 0.247596 0.209866 0.211111 0.201640 0.199674 0.249939 0.227007 0.193396 0.192950 0.248649 0.245656 0.212488 0.212643 0.217058
chargesum: 0.00000
title: Mulliken charges with hydrogens summed into heavy atoms:
elementType: O O O N C C C C C C C C C C C C C C C C C C C C C
charge: -0.262922 -0.237566 -0.266235 -0.092054 0.143261 -0.007998 0.012474 -0.006614 0.005371 0.034583 -0.073346 0.036949 0.174620 0.278485 -0.183111 0.479182 0.039459 -0.070823 -0.215698 0.109464 0.043505 0.345890 -0.139368 -0.103160 -0.044349
chargesum: 0.00003
polarizability: 3.57857598e+02 -1.33111766e+01 1.86465234e+02 -7.18677754e+00 -5.98425278e+00 2.08961302e+02
1716.lowfreq: -10.0802 -8.0824 -2.3880 -0.0477 -0.0006 0.0018 1.8932 10.6202 16.9809
frequency: -7.1499 10.1141 16.2175 22.0165 25.4057 36.5166 54.3738 59.1716 63.1774 70.8654 96.6261 106.6448 119.2257 139.5057 145.0525 154.2803 171.4001 187.2912 194.1566 209.0390 219.5111 228.5264 239.2641 274.4234 305.7323 312.8480 316.8387 345.9983 356.7694 378.6623 397.8057 408.3043 414.2729 450.4280 481.6890 488.2677 507.2560 513.9607 541.0606 576.6356 613.5524 630.5647 688.4954 722.1530 728.4474 742.5294 761.4761 766.6542 802.5672 804.8278 817.0628 819.4327 823.7412 832.9893 849.5733 866.0139 874.0495 886.1782 903.7686 919.8684 920.2143 937.8085 942.5394 950.7702 961.7115 971.9134 974.3896 994.1605 1004.7475 1027.5290 1041.1431 1042.1402 1064.8424 1080.9216 1084.2567 1088.3890 1096.9649 1110.4072 1119.6795 1124.4111 1125.1456 1145.3376 1148.6962 1154.2282 1179.2498 1180.2376 1183.3970 1192.7235 1213.3884 1214.3283 1226.3311 1240.6427 1257.9606 1263.5138 1274.6062 1275.2559 1280.5597 1283.1646 1287.4878 1297.6915 1299.1905 1308.2872 1320.7545 1336.7665 1339.5778 1344.3978 1348.1395 1353.3555 1364.7075 1370.9618 1374.5211 1375.7017 1388.2266 1389.1039 1392.3841 1418.9367 1444.4117 1448.0560 1457.2034 1465.3867 1467.9738 1468.3568 1471.4566 1472.3705 1473.9978 1476.8153 1481.5481 1485.3695 1487.4346 1489.8705 1490.4745 1504.0856 1584.6813 1625.6958 1643.9643 2837.6679 2846.7850 2941.2730 2966.5207 2967.5143 2972.2346 2976.2059 2976.4315 2980.5865 2984.4615 2989.5509 2994.9116 2997.6285 2997.7611 3004.1949 3010.5364 3013.4475 3028.0041 3033.3532 3042.3326 3053.2248 3053.3899 3059.2461 3070.4066 3075.0013 3075.0754 3076.6610 3082.1882 3084.4360 3121.7767 3147.3984 3162.3675 3169.7602
redmass: 4.6716 4.0892 6.2880 3.3881 4.3931 3.1990 3.6430 2.0743 2.6693 3.7515 3.4320 3.7630 2.2820 3.6557 2.2284 2.5829 2.7595 1.6593 2.2738 3.2910 2.7743 1.1316 3.2993 3.8387 2.9918 2.5170 2.0101 4.7116 3.0615 2.7650 2.9477 3.0058 2.9395 3.1518 3.7083 3.0645 2.8619 2.5950 3.2647 4.6518 2.0977 6.6648 4.5700 3.7138 3.7317 1.0765 1.1453 3.9531 1.5043 1.6931 1.7141 1.7811 1.4084 2.7781 2.0751 1.4396 4.1354 1.4895 1.7970 1.9228 1.9425 1.7776 1.3959 2.5130 1.4254 6.2059 1.7014 1.6607 2.7092 2.1382 3.4471 2.5785 2.0942 1.9441 2.1761 2.6827 2.4728 2.1145 1.6117 1.6341 1.9308 1.4443 2.1455 2.4106 1.2253 1.2796 1.5546 1.3391 1.3801 1.9346 3.8074 1.6809 1.2072 1.2057 1.2429 1.3013 1.1770 1.2173 1.0669 1.3039 1.4726 1.4638 1.6332 1.3627 1.3811 1.3795 1.4558 1.4169 1.4240 1.4743 1.3712 1.5411 1.7712 1.6025 1.4435 3.1849 1.1079 1.0892 1.0852 1.0775 1.0754 1.0776 1.0674 1.0757 1.0794 1.0422 1.1000 1.0718 1.0828 1.1223 1.0801 2.2760 6.9932 6.5000 9.7869 1.0715 1.0701 1.0549 1.0589 1.0787 1.0673 1.0601 1.0362 1.0387 1.0616 1.0654 1.0594 1.0583 1.1053 1.0858 1.1011 1.0613 1.0881 1.0947 1.1032 1.1035 1.1046 1.1042 1.0990 1.1013 1.0918 1.0995 1.0991 1.1055 1.0892 1.0880 1.0937 1.0971
irintensity: 0.0350 1.1595 0.5960 0.1406 0.0493 0.1351 0.2990 0.0719 0.1037 0.0971 1.1750 0.9381 0.9471 0.3344 2.8779 0.4107 1.6175 0.2768 2.7342 3.6936 2.5975 0.0931 1.3090 4.5452 0.7301 3.4237 0.6003 2.3698 10.0377 1.0000 3.4264 8.1090 0.6722 2.6801 0.5840 10.4707 9.8435 4.9708 20.1741 15.8238 2.5905 0.4332 7.9495 3.9712 9.7562 11.1424 3.2195 11.8340 17.5507 2.3867 5.4004 13.2471 2.0582 21.0898 3.8339 6.7252 16.3557 3.6610 20.8766 7.2504 2.3029 19.1050 20.9169 65.3381 3.8749 46.7941 4.7253 9.7561 10.0514 1.6697 23.6945 6.8078 111.0913 4.4270 6.4672 8.9454 402.4788 10.5269 86.7966 1.4477 27.5647 1.6776 36.2738 16.0571 22.0591 91.5253 0.2721 76.4890 0.4896 7.6881 230.2510 13.3401 5.7527 2.3714 0.3256 4.8848 0.5291 0.3101 0.0537 9.7182 27.2012 9.5192 49.7060 1.8078 16.0109 2.2191 0.6443 4.3790 5.8774 16.6669 20.8747 15.4438 6.7569 19.6089 5.1899 4.5801 25.2172 5.6773 12.2055 4.4724 9.7060 4.2099 6.1343 2.8933 2.9011 12.9283 41.5251 7.1356 10.4586 33.5758 3.5288 126.4436 12.3988 66.8262 142.1934 31.1641 145.9757 32.9347 35.8164 13.8725 20.8743 28.5351 35.3121 33.8163 46.7986 48.3753 37.3020 10.5126 31.9635 18.8502 5.6392 27.5764 70.4129 45.1122 20.8140 89.6198 1.8517 18.4105 45.1547 99.3495 6.0344 53.0075 28.3699 69.2107 18.8084 8.5055 18.8794 3.2470
temp: 298.150 k
press: 1.00000 atm
elementType: 8 8 8 7 6 6 6 6 6 6 6 6 6 6 6 6 6 6 6 6 6 6 6 6 6 1 1 1 1 1 1 1 1 1 1 1 1 1 1 1 1 1 1 1 1 1 1 1 1 1 1 1 1 1 1 1 1 1
symmnumber: 1
zpe: 1318360.5 jmol-1
zpe.correction: 0.502137 hartree
zpe.thermalcorrener: 0.528739 hartree
zpe.thermalcorrenthalpy: 0.529683 hartree
zpe.thermalcorrgfe: 0.440588 hartree
zpe.sumelectzpe: -1098.486591 hartree
zpe.sumelectthermal: -1098.459989 hartree
zpe.sumelectthermalent: -1098.459045 hartree
zpe.sumelectthermalfe: -1098.548140 hartree
dipole: 0.8687 0.5734 -1.9630
dipole: 2.2219
quadrupole: -120.5924 -149.0960 -155.2028
quadrupole: -4.9401 14.2715 -1.6728
quadrupole: 21.0380 -7.4656 -13.5724 -4.9401 14.2715 -1.6728
hfenergy: -1098.9887281 hartree
pointgroup: C01 [X(C21H33N1O3)]
dipole: 0.3504566 -0.0428615 -0.7996898 debye
polarizability: 358.1293756|-13.51939|184.9703111|-0.8052377|2.2863068|210.1844471 unknown
InChI: InChI=1S/C21H33NO3/c1-3-4-15-24-20-11-9-19(10-12-20)17-21(23)25-16-7-14-22-13-6-5-8-18(22)2/h9-12,18H,3-8,13-17H2,1-2H3
charge 0 multiplicity 1
58 atoms
O  1.34852 -0.557405 -0.070705
O  -0.033767 0.070889 1.697378
O  -6.404395 -0.157444 0.585058
N  6.228116 0.252643 -0.241145
C  7.255242 1.334455 -0.361708
C  8.46641 0.793367 -1.166828
C  6.741919 -0.987245 0.393042
C  9.04951 -0.498656 -0.54924
C  7.936582 -1.559055 -0.397605
C  4.9379 0.708546 0.325635
C  7.690726 1.973514 0.991536
C  3.739188 -0.115707 -0.202527
C  2.443778 0.280028 0.507062
C  0.146697 -0.581466 0.64545
C  -0.836885 -1.542713 -0.022033
C  -2.300332 -1.150646 0.11736
C  -8.670792 0.383856 -0.056313
C  -2.917419 -1.044241 1.393509
C  -3.089006 -0.904994 -1.029386
C  -7.266134 0.086888 -0.585675
C  -9.684323 0.629653 -1.198175
C  -5.056465 -0.474401 0.352726
C  -4.277472 -0.711587 1.513557
C  -4.459598 -0.568301 -0.928167
C  -11.104724 0.923206 -0.669192
H  6.78371 2.135755 -0.967031
H  8.123708 0.57379 -2.196746
H  9.2426 1.580204 -1.232819
H  7.048168 -0.815797 1.457817
H  5.925624 -1.732151 0.416294
H  9.867682 -0.885778 -1.185922
H  9.496073 -0.282162 0.44221
H  8.321405 -2.461431 0.115906
H  7.582443 -1.866877 -1.400537
H  4.794104 1.768676 0.037223
H  4.937619 0.68209 1.446335
H  8.390702 2.809503 0.807297
H  6.821125 2.380883 1.539475
H  8.198245 1.24962 1.653188
H  3.64429 0.040579 -1.291685
H  3.915124 -1.195662 -0.044729
H  2.18195 1.342779 0.34539
H  2.488832 0.100094 1.597354
H  -0.548917 -1.649685 -1.080866
H  -0.661142 -2.532604 0.449226
H  -9.004539 -0.467977 0.566999
H  -8.626493 1.268808 0.606973
H  -6.869785 0.945503 -1.168229
H  -7.271004 -0.811376 -1.239268
H  -2.320545 -1.206305 2.296663
H  -2.633045 -0.976935 -2.024683
H  -9.3407 1.479114 -1.823453
H  -9.714054 -0.257292 -1.863664
H  -4.758862 -0.62766 2.492727
H  -5.036849 -0.385516 -1.839224
H  -11.486717 0.075824 -0.069614
H  -11.108377 1.82017 -0.02204
H  -11.815052 1.099835 -1.49728
