program: Gaussian 09
title: 000046900
version: EM64L-G09RevD.01
frameworkgroup: C1[X(C12H30N2O)]
method: RPBEPBE
basis: SDD
operation: Freq
keyword: #p
keyword: freq=noraman
keyword: PBEPBE/SDD
title: #p freq=noraman PBEPBE/SDD
converged: YES YES NO NO
title: Mulliken charges:
elementType: O N N C C C C C C C C C C C C H H H H H H H H H H H H H H H H H H H H H H H H H H H H H H
charge: -0.269028 -0.116862 -0.116896 -0.326852 -0.326734 -0.426622 -0.426595 -0.552479 -0.539800 -0.552422 -0.552341 -0.552598 -0.539836 -0.245479 -0.245509 0.265864 0.265846 0.265797 0.265877 0.249731 0.249747 0.249617 0.249868 0.271282 0.273826 0.272042 0.271252 0.275147 0.271247 0.271284 0.272006 0.273822 0.273841 0.271251 0.271917 0.273812 0.272118 0.271309 0.275149 0.271259 0.271228 0.205947 0.206000 0.205975 0.205993
chargesum: 2.00000
title: Mulliken charges with hydrogens summed into heavy atoms:
elementType: O N N C C C C C C C C C C C C
charge: -0.269028 -0.116862 -0.116896 0.204858 0.204941 0.072855 0.072890 0.264670 0.277846 0.264691 0.264668 0.264641 0.277799 0.166468 0.166459
polarizability: 1.82282294e+02 -3.19074210e-03 1.26056005e+02 1.04614347e-03 -3.10660136e-03 1.22846807e+02
1716.lowfreq: -1.5318 -0.0007 -0.0006 0.0012 5.1483 8.6740 17.2315 28.7906 43.4293
frequency: 16.4399 28.2984 43.4291 53.9436 60.6346 88.1064 98.2464 111.6640 125.4738 137.0196 159.6239 196.4205 196.8428 212.0616 268.3746 268.7627 269.2033 276.1866 291.9700 325.1541 344.1241 344.2418 350.0630 402.0163 428.0187 430.8543 430.9055 459.7017 502.3942 511.8150 535.4108 725.0995 731.3255 771.8131 773.7402 865.2214 865.2700 876.1368 876.6472 922.9007 932.1729 933.5942 934.7847 943.3025 1039.0575 1047.2821 1047.2943 1058.5855 1061.5344 1066.8837 1068.8151 1072.9409 1075.1647 1114.8960 1122.6883 1135.5818 1146.2516 1175.1804 1186.4109 1217.5646 1219.6545 1240.4255 1244.2388 1249.0419 1249.2331 1288.8706 1290.3509 1294.2839 1301.5217 1325.2208 1325.5561 1363.7067 1382.0083 1382.1176 1420.3027 1425.4916 1425.9619 1427.7927 1427.8580 1450.1641 1450.3815 1455.5625 1455.6015 1460.9904 1461.2791 1466.5057 1466.6082 1470.8918 1472.3357 1476.6686 1483.3582 1488.0808 1488.7088 1488.7599 1490.4528 1490.4859 1496.5262 1501.8771 1502.3383 2929.3586 2936.4755 2983.1313 2985.7112 3011.9610 3012.1194 3022.2540 3022.3707 3026.7596 3026.7775 3029.3618 3029.3854 3032.6310 3032.6543 3072.7479 3072.8904 3098.0538 3098.1951 3142.5835 3142.6128 3144.5621 3144.5927 3146.2007 3146.2361 3150.0593 3150.0939 3155.2294 3155.2699 3158.7967 3158.8372
redmass: 2.5870 3.5216 3.9343 1.8566 2.9339 1.6449 2.2271 3.4551 1.8486 2.7037 4.1727 1.1923 1.1988 3.4738 1.1090 1.0752 1.1654 1.0334 2.3626 3.0937 2.2227 2.2249 2.7785 2.6839 2.9510 2.2792 2.2797 2.5994 2.6366 3.3831 2.9711 4.2816 4.2671 1.1087 1.1161 2.2926 1.7369 1.4100 3.3486 3.9416 2.2784 2.9193 2.1287 3.6433 3.5139 1.1959 1.1967 2.9767 2.3666 5.3582 1.2896 1.2676 2.4812 1.5760 1.8350 1.4084 1.4875 1.2103 1.2977 1.7353 1.8029 1.5745 1.5501 1.8872 1.8886 1.1123 1.2967 1.1087 1.3539 1.2330 1.2315 1.2542 1.2974 1.3133 1.3569 1.1528 1.1730 1.1426 1.1426 1.0855 1.0852 1.0460 1.0461 1.1069 1.1073 1.0395 1.0395 1.0683 1.0725 1.0899 1.0898 1.0870 1.0522 1.0525 1.0530 1.0555 1.0786 1.0605 1.0613 1.0553 1.0549 1.1067 1.1081 1.0595 1.0596 1.0563 1.0562 1.0334 1.0334 1.0322 1.0322 1.0339 1.0339 1.1055 1.1055 1.1064 1.1063 1.1055 1.1055 1.1059 1.1059 1.1054 1.1055 1.1054 1.1053 1.1055 1.1055 1.1050 1.1050
irintensity: 0.0002 2.8548 3.6018 5.8473 0.0000 0.0001 0.8113 0.9711 0.0000 8.1911 0.2996 0.0002 0.0546 1.7078 0.0197 0.0016 0.0400 0.1674 0.0123 3.5446 0.0219 0.2453 0.0277 1.6331 0.0068 0.0180 0.1178 0.0184 0.0554 13.3158 1.8541 1.8628 0.0920 0.0001 17.7287 0.0268 0.0110 7.5230 103.9812 0.3693 0.0020 1.7111 21.8592 42.4419 19.5025 0.0022 0.0142 67.9491 0.1373 103.6555 0.0002 0.5168 2.0663 0.2883 4.0363 0.0000 1.6515 0.0000 3.1577 2.9273 0.4510 0.0000 0.1992 2.0402 0.3735 0.0051 13.6141 1.4551 1.1121 0.0028 0.1550 78.6536 7.6768 8.0090 6.0444 9.1625 16.7849 0.1869 43.6861 2.8621 0.8580 0.0356 4.0040 3.4297 11.2772 0.0213 2.3921 1.0381 1.3376 12.4489 0.1534 1.3171 2.6959 78.3929 31.1226 89.8022 0.3317 52.4727 122.1096 25.4339 69.6303 67.4840 0.0068 3.9222 2.7434 0.5688 24.2705 3.5562 5.9879 1.9458 2.3659 0.4740 0.6723 0.0946 0.8605 2.7858 37.2978 0.6099 0.9299 0.9067 0.4931 2.5982 3.2801 5.1585 5.6844 0.7185 0.7644 7.1746 5.8129
temp: 298.150 k
press: 1.00000 atm
elementType: 8 7 7 6 6 6 6 6 6 6 6 6 6 6 6 1 1 1 1 1 1 1 1 1 1 1 1 1 1 1 1 1 1 1 1 1 1 1 1 1 1 1 1 1 1
symmnumber: 1
zpe: 1099216.6 jmol-1
zpe.correction: 0.418670 hartree
zpe.thermalcorrener: 0.438999 hartree
zpe.thermalcorrenthalpy: 0.439943 hartree
zpe.thermalcorrgfe: 0.368214 hartree
zpe.sumelectzpe: -658.128126 hartree
zpe.sumelectthermal: -658.107797 hartree
zpe.sumelectthermalent: -658.106852 hartree
zpe.sumelectthermalfe: -658.178581 hartree
dipole: 0.0009 -0.0930 0.0027
dipole: 0.0931
quadrupole: 163.9757 -78.2365 -79.6713
quadrupole: 0.0005 -0.0014 0.0008
quadrupole: 161.9531 -80.2592 -81.6939 0.0005 -0.0014 0.0008
hfenergy: -658.5467953 hartree
pointgroup: C01 [X(C12H30N2O1)]
dipole: 0.0003279 0.0365967 -0.001068 debye
polarizability: 182.2822748|0.0320408|126.0560209|-0.0081727|-0.0041163|122.8468106 unknown
InChI: InChI=1S/C12H30N2O/c1-13(2,3)9-7-11-15-12-8-10-14(4,5)6/h7-12H2,1-6H3
charge 2 multiplicity 1
45 atoms
O  -0.001568 0.089603 0.000734
N  5.013297 -0.202691 -0.000634
N  -5.016316 -0.207885 0.000379
C  3.731762 0.672618 -0.000605
C  -3.735388 0.668988 0.000507
C  2.39758 -0.094092 -0.000408
C  -2.400552 -0.096339 0.002097
C  5.074891 -1.08415 -1.248804
C  6.222515 0.740666 -0.002008
C  5.076176 -1.082304 1.248735
C  -5.078468 -1.086881 -1.249431
C  -5.076826 -1.090101 1.248042
C  -6.226384 0.734287 0.002426
C  1.220976 0.902944 -0.000267
C  -1.224834 0.901828 -0.00033
H  3.812444 1.316937 0.893606
H  3.812264 1.31668 -0.895019
H  -3.816387 1.312197 -0.894462
H  -3.817545 1.313793 0.894224
H  2.292807 -0.734521 0.893043
H  2.292653 -0.734576 -0.893799
H  -2.294996 -0.738733 -0.889861
H  -2.294997 -0.734577 0.897003
H  4.987532 -0.449195 -2.143668
H  6.040425 -1.612434 -1.261385
H  4.257027 -1.817606 -1.223806
H  6.189102 1.372908 0.898361
H  7.146089 0.142412 -0.001369
H  6.188812 1.370595 -0.903982
H  4.990064 -0.446069 2.142806
H  4.258072 -1.815561 1.225804
H  6.041556 -1.610876 1.26091
H  -6.042927 -1.617142 -1.261293
H  -4.994014 -0.45002 -2.143214
H  -4.259093 -1.818755 -1.227437
H  -6.0424 -1.618308 1.261113
H  -4.25906 -1.823629 1.221878
H  -4.98864 -0.455757 2.143263
H  -7.149392 0.135162 0.000191
H  -6.19391 1.362819 0.905419
H  -6.192968 1.368007 -0.896909
H  1.248077 1.553178 -0.902346
H  1.248927 1.554011 0.901184
H  -1.252655 1.5542 0.900174
H  -1.253326 1.550669 -0.903364
