program: Gaussian 09
title: 000046884
version: EM64L-G09RevD.01
frameworkgroup: C1[X(C14H24N)]
method: RPBEPBE
basis: SDD
operation: Freq
keyword: #p
keyword: freq=noraman
keyword: PBEPBE/SDD
title: #p freq=noraman PBEPBE/SDD
converged: YES YES NO NO
title: Mulliken charges:
elementType: N C C C C C C C C C C C C C C H H H H H H H H H H H H H H H H H H H H H H H H
charge: -0.104680 -0.366514 -0.292071 -0.298506 -0.293431 -0.604483 -0.703532 -0.704809 -0.708085 0.499978 -0.406255 -0.405609 -0.220623 -0.219331 -0.225388 0.279943 0.277557 0.253392 0.260190 0.259350 0.258041 0.262617 0.257115 0.238159 0.241232 0.267875 0.242274 0.244580 0.268091 0.248690 0.241418 0.268218 0.243646 0.242975 0.232213 0.227374 0.244129 0.244113 0.250144
chargesum: 1.00000
title: Mulliken charges with hydrogens summed into heavy atoms:
elementType: N C C C C C C C C C C C C C C
charge: -0.104680 0.190986 0.221511 0.218885 0.226301 -0.125092 0.051198 0.053391 0.046755 0.499978 -0.174042 -0.178235 0.023506 0.024782 0.024756
polarizability: 1.87911362e+02 1.55087235e+00 1.51328689e+02 -1.36739672e+01 5.78068015e+00 1.14982296e+02
1716.lowfreq: -13.7504 -2.5812 -0.0008 -0.0006 0.0004 8.1646 19.7575 30.8972 60.4470
frequency: 15.6583 30.1802 60.4138 80.0536 95.0729 116.2530 125.6598 157.4085 212.1996 224.3453 235.7166 260.8041 286.2231 303.5774 326.1019 338.9187 359.0409 374.6015 401.5737 437.6106 458.4223 511.3014 529.0745 584.2429 617.3277 667.3484 707.2341 762.3779 768.9863 773.0553 786.4519 803.3008 818.8896 852.9462 861.8639 867.2175 907.1784 927.8786 980.6891 990.3478 1007.8754 1008.5778 1018.5002 1026.2938 1027.0262 1040.3070 1044.4277 1073.1034 1081.9480 1105.0273 1116.6161 1152.6160 1167.0928 1179.7997 1180.5035 1190.3264 1209.7470 1218.3407 1283.2657 1288.4326 1292.2198 1299.9309 1330.0037 1336.5147 1348.8015 1370.2709 1374.6945 1377.5615 1385.3843 1411.9676 1412.7059 1417.9366 1444.2045 1460.4239 1470.5209 1473.7103 1476.8732 1477.6305 1481.1346 1483.6728 1486.3144 1488.0890 1490.3910 1493.5380 1501.6674 1596.4259 1611.7390 3007.0917 3007.5126 3007.6444 3008.4739 3038.8157 3040.6095 3042.5943 3043.3302 3065.9176 3092.5862 3094.6165 3095.4107 3096.1640 3098.3615 3099.8099 3110.8195 3114.6497 3114.9870 3119.7648 3120.9374 3123.2479 3145.2210 3156.8588 3174.4919
redmass: 3.5609 3.3058 3.0424 2.0586 2.1441 2.1060 2.2713 3.1230 2.3758 1.8059 1.0714 1.6749 1.9563 1.9277 2.0470 2.3791 2.7970 2.4717 2.8070 2.8307 3.0039 3.1176 3.1581 3.6041 6.3797 3.1747 1.7801 1.7774 1.3310 1.2689 1.7227 1.2128 2.4780 1.2743 1.8166 1.8438 2.0896 1.5741 1.3877 6.2023 1.3369 1.8074 1.8059 2.2375 2.1924 2.7001 3.2909 1.8985 1.7099 1.6132 2.1228 1.6726 1.9373 1.8067 1.0821 1.1126 2.7309 1.4136 1.1780 1.1406 1.1454 1.2588 1.2561 1.1638 1.2373 1.2925 1.2905 1.3070 6.8856 1.2131 1.2058 1.1874 2.1247 1.0702 1.0780 1.0637 1.0768 1.0747 1.0959 1.7031 1.0494 1.1434 1.0685 1.0678 1.0741 6.0045 6.1225 1.0397 1.0555 1.0381 1.0384 1.0605 1.0603 1.0600 1.0593 1.1029 1.1039 1.0997 1.0986 1.0984 1.1016 1.1007 1.0902 1.1011 1.0935 1.1035 1.1040 1.1038 1.0890 1.0950 1.1013
irintensity: 0.0015 0.0799 0.1305 1.1174 0.3143 0.6205 0.1400 0.9529 1.9200 0.6739 0.0428 0.5641 0.6424 0.2232 0.2180 0.2079 0.2063 0.0892 0.0219 3.7712 0.5692 21.5308 1.6244 2.2066 0.0150 1.1015 49.1532 73.4185 10.7899 7.9906 26.6041 3.1483 6.6666 0.3600 3.4453 0.9455 11.1057 2.6447 0.0179 2.5391 0.3712 23.6742 16.7636 2.3707 21.7642 8.1667 7.1644 1.8077 2.8918 15.4162 2.5602 6.8336 8.9760 10.8381 0.6692 0.2888 1.3611 1.3492 9.0358 2.5063 3.1599 5.3241 0.5584 1.5066 2.0586 1.9120 0.8723 0.6058 0.1880 27.1265 29.6720 31.1624 8.6224 2.5685 8.0318 18.7486 25.1911 46.5482 37.3245 4.5419 9.8855 4.8100 13.8387 7.8510 1.3642 2.6704 1.9186 1.8833 24.3713 4.7252 2.7617 9.1595 12.1057 7.7868 2.3386 7.6526 2.1741 3.0796 3.8596 7.5019 3.9386 3.2947 10.2195 14.7704 17.0174 31.2993 34.1633 9.3111 1.5639 18.3656 10.7169
temp: 298.150 k
press: 1.00000 atm
elementType: 7 6 6 6 6 6 6 6 6 6 6 6 6 6 6 1 1 1 1 1 1 1 1 1 1 1 1 1 1 1 1 1 1 1 1 1 1 1 1
symmnumber: 1
zpe: 926218.4 jmol-1
zpe.correction: 0.352778 hartree
zpe.thermalcorrener: 0.369440 hartree
zpe.thermalcorrenthalpy: 0.370384 hartree
zpe.thermalcorrgfe: 0.307458 hartree
zpe.sumelectzpe: -601.216393 hartree
zpe.sumelectthermal: -601.199731 hartree
zpe.sumelectthermalent: -601.198787 hartree
zpe.sumelectthermalfe: -601.261713 hartree
dipole: 7.2608 0.2219 0.3369
dipole: 7.2720
quadrupole: -51.8154 -75.4452 -85.0283
quadrupole: 0.3651 -2.9413 1.3315
quadrupole: 18.9475 -4.6822 -14.2653 0.3651 -2.9413 1.3315
hfenergy: -601.5691708 hartree
pointgroup: C01 [X(C14H24N1)]
dipole: -2.8594097 -0.0849766 0.0455462 debye
polarizability: 187.030024|1.4409384|151.4940747|15.8526049|-5.1983757|115.6982486 unknown
InChI: InChI=1S/C14H24N/c1-4-15(5-2,6-3)13-12-14-10-8-7-9-11-14/h7-11H,4-6,12-13H2,1-3H3
charge 1 multiplicity 1
39 atoms
N  -2.087127 -0.088708 -0.034066
C  -0.565494 0.034622 0.253004
C  -2.42817 -1.471161 -0.652088
C  -2.858291 0.062396 1.306087
C  -2.495032 1.020822 -1.040547
C  0.386266 -0.215499 -0.939324
C  -1.967657 -2.692223 0.153721
C  -2.742218 1.429588 1.991237
C  -3.997295 1.14255 -1.32479
C  1.821195 -0.041773 -0.440076
C  2.432459 1.237554 -0.445955
C  2.542789 -1.148542 0.07428
C  3.743641 1.407628 0.051874
C  3.854243 -0.980451 0.572717
C  4.455923 0.299106 0.565182
H  -0.341154 -0.674277 1.067157
H  -0.40781 1.054619 0.639498
H  -3.523822 -1.486116 -0.772939
H  -1.976555 -1.475515 -1.657942
H  -3.911561 -0.173664 1.080701
H  -2.46725 -0.727208 1.968028
H  -2.096835 1.963999 -0.631551
H  -1.948249 0.799051 -1.971618
H  0.253867 -1.235291 -1.342959
H  0.190894 0.501155 -1.756802
H  -2.261848 -3.593647 -0.412576
H  -0.873781 -2.737801 0.28415
H  -2.449492 -2.768446 1.141952
H  -3.342386 1.387271 2.917536
H  -1.712083 1.678432 2.293893
H  -3.148688 2.256284 1.385736
H  -4.134198 1.973939 -2.038825
H  -4.424055 0.244341 -1.800573
H  -4.591033 1.389723 -0.429082
H  1.894879 2.100618 -0.860027
H  2.091976 -2.149722 0.065452
H  4.211893 2.397257 0.031761
H  4.408079 -1.84365 0.956283
H  5.474084 0.42934 0.94609
