program: Gaussian 09
title: 000046829
version: EM64L-G09RevD.01
frameworkgroup: C1[X(C10H19N)]
method: RPBEPBE
basis: SDD
operation: Freq
keyword: #pfreq=noraman
keyword: PBEPBE/SDD
title: #p freq=noraman PBEPBE/SDD
converged: YES YES NO NO
title: Mulliken charges:
elementType: N C C C C C C C C C C H H H H H H H H H H H H H H H H H H H
charge: -0.105400 -0.138932 -0.118623 -0.513648 0.010383 -0.453889 -0.433308 -0.445254 -0.435777 -0.638375 -0.715429 0.231006 0.218094 0.214253 0.219599 0.167250 0.206443 0.208981 0.208403 0.212275 0.217815 0.179285 0.203285 0.220716 0.216203 0.231342 0.185975 0.210643 0.221951 0.214731
chargesum: 0.00000
title: Mulliken charges with hydrogens summed into heavy atoms:
elementType: N C C C C C C C C C C
charge: -0.105400 0.092074 0.099471 -0.079796 0.177633 -0.038465 -0.012629 -0.048154 -0.011776 -0.004855 -0.068103
polarizability: 1.18698260e+02 -6.56994646e-01 1.10377601e+02 -1.43542031e-01 4.54684929e-01 9.61660185e+01
1716.lowfreq: -16.4397 -5.0160 -0.0009 -0.0009 -0.0009 10.8628 49.7860 93.6741 137.4115
frequency: 49.6940 93.5797 137.3893 182.6056 195.3217 224.2656 261.6407 317.5102 329.6412 341.7223 390.6544 433.5433 442.8882 497.5786 530.5031 709.3541 728.7145 752.6810 775.5339 813.8433 832.1103 883.3422 894.6674 910.4035 936.3256 963.6550 976.0069 999.7145 1008.0580 1023.8505 1051.3614 1070.4790 1078.5686 1099.7523 1107.4918 1118.0882 1137.2573 1148.1020 1165.9370 1186.3026 1200.5762 1214.2443 1241.9164 1255.3739 1261.8538 1281.5750 1286.9897 1301.9628 1316.5200 1322.5672 1328.9414 1344.4214 1347.1650 1366.6217 1389.5584 1430.5955 1453.0590 1461.4641 1462.0265 1474.6219 1475.3370 1477.3503 1480.2595 1482.5022 1491.6424 2785.5472 2822.6030 2849.0460 2976.6349 2983.8570 2988.5887 2989.8550 2998.3721 3004.4502 3026.4218 3027.1986 3038.8222 3043.1764 3049.1184 3054.2728 3068.6464 3078.1668 3080.2100 3085.4641
redmass: 2.3402 2.2418 2.0266 1.2451 1.7913 1.8502 1.4544 2.9592 2.1338 2.3881 2.2046 2.6268 2.8477 2.7589 2.7129 2.3623 3.0694 3.1283 1.4713 2.2795 1.7884 2.2116 2.6507 2.0556 1.6857 1.7370 1.8645 1.8520 2.2089 1.9057 1.7371 2.0531 1.3935 1.3802 2.3902 1.3931 1.2649 1.7294 1.2337 2.1449 1.4486 1.7395 1.5424 1.5086 1.3519 1.3379 1.3802 1.4800 1.4810 1.4622 1.6652 1.4180 1.6729 1.3710 1.2094 1.1661 1.0830 1.0709 1.0891 1.0842 1.0617 1.0580 1.0729 1.0641 1.0574 1.0796 1.0700 1.0587 1.0364 1.0601 1.0604 1.0621 1.0867 1.0655 1.0782 1.0789 1.0983 1.0877 1.1043 1.1000 1.0989 1.1029 1.0999 1.0987
irintensity: 0.0300 0.8301 0.6072 0.4043 0.6908 0.0259 0.9832 5.0055 0.2029 0.0998 0.4889 1.4803 1.0495 1.1061 0.9614 1.9735 1.6570 3.3862 5.9963 5.5954 4.7221 0.1934 4.8136 3.5698 2.6065 10.5023 5.7318 2.9333 6.8270 9.0627 3.9038 7.0946 1.1427 3.1505 22.1596 1.6052 0.9157 2.6155 11.6650 8.3658 2.7368 5.3676 3.5761 15.1810 3.7898 0.3952 6.7299 3.2503 0.7289 0.7738 0.2660 5.4717 6.2337 3.8092 15.4019 2.7576 2.1368 22.1609 11.6705 18.2946 1.4284 6.5718 13.0919 10.1310 12.2202 72.0199 88.2081 196.1858 36.2853 38.7506 21.5079 17.3656 40.9771 72.7603 65.3984 106.1866 19.6942 16.7239 40.7561 0.9825 50.8788 69.7480 45.1899 51.5826
temp: 298.150 k
press: 1.00000 atm
elementType: 7 6 6 6 6 6 6 6 6 6 6 1 1 1 1 1 1 1 1 1 1 1 1 1 1 1 1 1 1 1
symmnumber: 1
zpe: 717159.7 jmol-1
zpe.correction: 0.273152 hartree
zpe.thermalcorrener: 0.284232 hartree
zpe.thermalcorrenthalpy: 0.285176 hartree
zpe.thermalcorrgfe: 0.236891 hartree
zpe.sumelectzpe: -446.296939 hartree
zpe.sumelectthermal: -446.285858 hartree
zpe.sumelectthermalent: -446.284914 hartree
zpe.sumelectthermalfe: -446.333200 hartree
dipole: 0.1555 0.2640 0.6409
dipole: 0.7103
quadrupole: -68.4959 -67.9272 -71.3624
quadrupole: 0.3720 -0.5137 0.0523
quadrupole: 0.7659 1.3347 -2.1006 0.3720 -0.5137 0.0523
hfenergy: -446.5700907 hartree
pointgroup: C01 [X(C10H19N1)]
dipole: -0.0649906 -0.1066426 0.2500148 debye
polarizability: 118.6197327|-1.0433866|110.4701604|0.0120868|-0.1292094|96.1519862 unknown
InChI: InChI=1S/C10H19N/c1-3-10-9-5-4-8(6-9)7-11(10)2/h8-10H,3-7H2,1-2H3
charge 0 multiplicity 1
30 atoms
N  -0.097812 -1.24061 -0.250074
C  0.01047 1.159981 0.403871
C  2.038395 -0.066937 0.358287
C  1.263301 0.906218 1.280519
C  -0.872088 -0.126442 0.381886
C  0.637846 1.46841 -0.990872
C  1.978051 0.652213 -1.023462
C  1.266479 -1.405337 0.320841
C  -2.227869 0.08783 -0.341578
C  -0.802647 -2.538115 -0.284136
C  -3.086825 1.224754 0.25628
H  -0.596711 1.999591 0.784146
H  3.074393 -0.257204 0.694646
H  1.022974 0.469262 2.268263
H  1.830087 1.842818 1.443383
H  -1.106773 -0.377916 1.454776
H  0.831935 2.553332 -1.087788
H  -0.033064 1.172372 -1.815172
H  1.983406 -0.078309 -1.851189
H  2.850996 1.319753 -1.149455
H  1.807281 -2.136749 -0.31137
H  1.231688 -1.828622 1.360414
H  -2.816976 -0.846592 -0.288387
H  -2.036134 0.277398 -1.415659
H  -0.13409 -3.295963 -0.731157
H  -1.707543 -2.484862 -0.911243
H  -1.102216 -2.904679 0.731802
H  -3.200845 1.105571 1.351008
H  -2.648776 2.221037 0.069004
H  -4.098935 1.220398 -0.187983
