program: Gaussian 16
title: Title Card Required
version: ES64L-G16RevB.01
frameworkgroup: C1[X(C11H12F2O2)]
method: RPBE1PBE
basis: 6-31+G(d,p)
operation: Freq
keyword: #P
keyword: Geom=AllCheck
keyword: Guess=TCheck
keyword: SCRF=Check
keyword: GenChk
keyword: RPBE1PBE/6-31+G(d,p)
keyword: Freq
converged: YES YES NO YES
title: Mulliken charges:
elementType: C C C C C C H H H H H C H C H H C H F F O C O C H H H
charge: -0.388765 -0.226942 0.372644 0.119201 -0.359104 -0.123554 0.197932 0.192953 0.192671 0.197474 0.195488 -0.523699 0.199678 -0.348331 0.230982 0.233718 0.362529 0.198984 -0.323163 -0.310579 -0.153865 0.400191 -0.430426 -0.566716 0.212196 0.227755 0.220747
chargesum: -0.00000
title: Mulliken charges with hydrogens summed into heavy atoms:
elementType: C C C C C C C C C F F O C O C
charge: -0.190833 -0.033989 0.372644 0.311871 -0.161630 0.071933 -0.324021 0.116369 0.561513 -0.323163 -0.310579 -0.153865 0.400191 -0.430426 0.093983
polarizability: 2.01267320e+02 7.11335676e+00 1.63025105e+02 1.74954274e+00 2.22546291e+01 1.79542371e+02
1716.lowfreq: -7.6986 -0.0011 -0.0001 0.0006 6.0775 8.5490 24.1767 29.1540 43.0558
frequency: 23.9070 28.4135 43.0056 47.9094 77.8555 87.3445 90.4646 173.7555 186.8365 241.0445 249.7688 333.9752 374.1002 407.0818 413.9647 488.1866 507.4170 544.4959 594.9008 626.8226 628.2601 657.9834 714.2240 722.7027 772.6339 843.6532 866.4884 878.4513 913.4831 943.9798 965.6883 994.8883 999.6528 1015.7589 1016.6804 1037.2625 1057.3659 1057.9970 1083.9849 1112.5679 1119.8323 1146.9461 1173.8463 1197.0037 1226.8258 1261.7452 1284.5265 1306.5918 1342.2254 1373.9625 1387.4877 1392.9915 1406.9008 1412.7222 1421.6271 1440.9130 1443.4521 1456.0214 1490.4512 1535.8492 1656.2324 1675.7199 1802.6882 3081.3163 3099.3763 3125.5759 3155.5506 3158.0164 3163.9373 3200.8425 3206.4702 3208.4916 3216.6130 3224.1616 3232.2041
redmass: 4.8203 5.9614 8.0829 1.3317 3.8078 2.7401 5.8586 9.2959 4.4159 5.3294 5.5735 4.5534 3.4910 2.6188 2.8685 4.7442 4.8038 3.4483 3.5938 6.0431 3.8532 4.9124 1.9544 3.8859 1.9957 2.4531 1.2620 3.4544 3.2035 1.5212 3.8410 3.0709 1.3764 5.9627 1.2923 2.0283 1.8431 2.2038 3.1121 1.7714 2.9748 2.7640 1.0733 1.1134 1.6205 1.6846 2.5664 1.5482 1.3363 1.9414 1.5586 1.4219 1.5158 1.4637 1.9661 1.1095 1.0541 1.0615 2.2682 2.4262 6.1489 6.1067 11.3600 1.0382 1.0632 1.0856 1.0899 1.1025 1.1004 1.0885 1.1052 1.0877 1.0915 1.0954 1.0994
irintensity: 0.7287 4.1324 1.1827 4.3533 0.2602 5.5726 0.4572 3.5953 6.1047 2.0433 5.7272 3.6761 7.8803 10.4020 0.4086 20.0060 15.8653 41.0389 1.3832 1.2483 21.4698 16.9692 78.8651 26.9152 57.4808 20.6247 0.0746 11.8259 9.4581 15.5854 87.1878 3.0260 0.0309 1.9995 0.5498 66.8546 19.1808 37.1859 300.2072 64.8282 92.9114 138.6622 0.0629 0.8529 35.2547 4.0038 486.2411 73.1226 11.1254 8.5692 46.6805 56.6997 122.2642 48.3038 69.7109 28.6630 28.7152 26.8799 8.8386 13.6508 2.3512 3.3951 482.3077 0.1627 2.1076 7.5409 30.2749 4.1392 1.5787 5.7568 5.1273 0.1280 10.0559 25.2637 12.7658
temp: 298.150 k
press: 1.00000 atm
elementType: 6 6 6 6 6 6 1 1 1 1 1 6 1 6 1 1 6 1 9 9 8 6 8 6 1 1 1
symmnumber: 1
zpe: 561372.0 jmol-1
zpe.correction: 0.213815 hartree
zpe.thermalcorrener: 0.228238 hartree
zpe.thermalcorrenthalpy: 0.229182 hartree
zpe.thermalcorrgfe: 0.169016 hartree
zpe.sumelectzpe: -775.568835 hartree
zpe.sumelectthermal: -775.554412 hartree
zpe.sumelectthermalent: -775.553468 hartree
zpe.sumelectthermalfe: -775.613634 hartree
dipole: -1.5237 -2.0536 4.1597
dipole: 4.8828
quadrupole: -86.1068 -77.3776 -88.8527
quadrupole: 1.9014 3.2957 5.9401
quadrupole: -1.9944 6.7348 -4.7403 1.9014 3.2957 5.9401
hfenergy: -775.7826499 hartree
pointgroup: C01 [X(C11H12F2O2)]
dipole: -0.1873189 1.7302436 -0.8133875 debye
polarizability: 191.6964114|-4.7051384|180.6268526|16.2379848|22.9960856|171.511533 unknown
InChI: InChI=1S/C11H12F2O2/c1-8(14)15-10(7-11(12)13)9-5-3-2-4-6-9/h2-6,10-11H,7H2,1H3
charge 0 multiplicity 1
27 atoms
C  2.98741128 2.47206079 3.32829144
C  2.81114867 1.42127224 2.4289583
C  1.61666759 1.29395091 1.71556385
C  0.59712331 2.22909308 1.91359875
C  0.77059138 3.276906 2.81748106
C  1.966367 3.4025765 3.52545207
H  3.91904207 2.55852183 3.88149572
H  3.60377545 0.69021493 2.28345846
H  -0.33701565 2.13294864 1.36626697
H  -0.03016305 3.99633258 2.96828711
H  2.10014917 4.21879741 4.23052383
C  1.46329146 0.17840825 0.70686466
H  2.10200601 -0.66049898 0.99814058
C  1.82358577 0.65114526 -0.6960883
H  1.0789464 1.36689078 -1.0605815
H  2.78295456 1.17681014 -0.6484443
C  1.98274872 -0.4368348 -1.72453942
H  2.33786664 -0.06711289 -2.69011592
F  2.88224383 -1.38654698 -1.28597241
F  0.80755996 -1.11549996 -1.94731435
O  0.09829973 -0.27629732 0.65615202
C  -0.29902678 -1.14189636 1.60364345
O  0.43902674 -1.57357024 2.46667567
C  -1.74794819 -1.47776139 1.45195814
H  -2.00901558 -2.30200215 2.11586767
H  -2.34644737 -0.59781988 1.71215762
H  -1.97462162 -1.73837287 0.41447909
