program: Gaussian 16
title: Title Card Required
version: ES64L-G16RevB.01
frameworkgroup: C1[X(C11H12F2O2)]
method: RPBE1PBE
basis: 6-31+G(d,p)
operation: Freq
keyword: #P
keyword: Geom=AllCheck
keyword: Guess=TCheck
keyword: SCRF=Check
keyword: GenChk
keyword: RPBE1PBE/6-31+G(d,p)
keyword: Freq
converged: YES YES NO YES
title: Mulliken charges:
elementType: C C C C C C H H H H H C H C H H C H F F O C O C H H H
charge: -0.391719 -0.204339 0.401067 0.121915 -0.397701 -0.132873 0.198260 0.193229 0.192622 0.197705 0.195894 -0.427064 0.203905 -0.564924 0.234824 0.235218 0.518465 0.199689 -0.336944 -0.324852 -0.184409 0.399248 -0.426885 -0.564283 0.213531 0.228724 0.221697
chargesum: -0.00000
title: Mulliken charges with hydrogens summed into heavy atoms:
elementType: C C C C C C C C C F F O C O C
charge: -0.193458 -0.011110 0.401067 0.314537 -0.199997 0.063021 -0.223159 -0.094882 0.718154 -0.336944 -0.324852 -0.184409 0.399248 -0.426885 0.099669
chargesum: 0.00000
polarizability: 1.98104532e+02 1.33110456e+01 1.59553610e+02 -3.18512562e-01 -1.75828390e+01 1.85732893e+02
1716.lowfreq: -7.2672 -0.0008 -0.0006 0.0007 7.4569 9.1855 23.0331 38.7990 49.3609
frequency: 22.6637 38.7289 49.3344 55.7263 70.5128 75.6032 85.5639 169.2218 194.3033 237.4108 263.4550 315.1371 334.5366 412.0223 447.8631 464.4733 537.4118 542.7158 575.8891 606.0447 627.3951 635.9521 679.6630 714.8536 778.5014 824.2883 866.3991 879.6837 935.0197 942.6060 985.4010 999.2477 1015.7819 1017.3341 1028.5567 1053.2440 1057.3748 1058.5085 1088.5658 1110.2110 1129.1004 1139.7917 1173.7267 1194.5331 1229.4050 1261.0217 1275.2820 1292.4072 1335.8375 1362.0277 1373.0736 1388.1218 1393.8738 1408.2462 1432.0955 1444.1603 1448.3008 1456.0356 1490.2387 1535.4826 1656.5833 1675.7270 1807.9081 3081.7283 3094.5449 3124.6615 3154.4079 3164.3342 3168.2816 3202.5318 3206.6747 3208.1733 3216.1661 3223.7902 3232.2213
redmass: 3.8627 7.7251 7.1175 1.7047 5.3103 4.9135 1.7989 6.1426 4.6136 5.6585 4.4638 4.2447 4.7140 2.8723 3.9536 3.3220 4.1701 4.9758 3.1502 2.9959 6.0371 4.4631 4.7598 1.7097 1.9486 3.1330 1.2517 3.0571 2.4066 1.6982 3.9114 1.3761 5.9347 1.2918 2.1445 3.8879 2.1664 1.8363 3.5053 1.7041 3.4997 2.3656 1.0744 1.1126 1.7132 1.7550 2.0816 1.6124 1.4521 1.2557 2.1477 1.2196 1.7974 1.6899 1.4995 1.0525 1.2679 1.0610 2.2716 2.4498 6.1543 6.1437 11.4165 1.0382 1.0619 1.0861 1.0987 1.1003 1.0947 1.0881 1.1053 1.0879 1.0915 1.0957 1.0995
irintensity: 0.2734 1.8210 2.9824 4.6373 0.5482 3.9858 2.2224 5.4888 4.1544 8.7006 0.7338 7.3599 4.1679 0.3966 6.9270 24.9321 1.2701 36.6448 34.3557 2.5933 0.9582 7.4124 23.0082 101.1702 53.6818 16.1965 0.0913 37.5113 10.3393 13.6593 28.0651 0.0511 1.6074 0.2877 163.8515 125.8108 19.9122 18.5280 303.7775 42.0828 96.1365 93.0637 0.0293 1.3681 28.9006 4.0346 331.6103 223.6796 7.4504 0.5293 5.9361 41.2558 68.4162 90.1734 67.3338 27.4350 57.0980 27.5849 9.2661 12.8905 1.9933 2.5395 472.9585 0.1035 3.5739 9.5397 3.7950 1.5953 22.6403 4.9078 4.8152 0.1365 7.9031 25.7333 12.4463
temp: 298.150 k
press: 1.00000 atm
elementType: 6 6 6 6 6 6 1 1 1 1 1 6 1 6 1 1 6 1 9 9 8 6 8 6 1 1 1
symmnumber: 1
zpe: 560915.2 jmol-1
zpe.correction: 0.213641 hartree
zpe.thermalcorrener: 0.228115 hartree
zpe.thermalcorrenthalpy: 0.229059 hartree
zpe.thermalcorrgfe: 0.168954 hartree
zpe.sumelectzpe: -775.570976 hartree
zpe.sumelectthermal: -775.556502 hartree
zpe.sumelectthermalent: -775.555558 hartree
zpe.sumelectthermalfe: -775.615664 hartree
dipole: 1.3257 -0.9218 3.4720
dipole: 3.8291
quadrupole: -87.8785 -87.2025 -86.9071
quadrupole: 13.0323 -1.1213 -11.0802
quadrupole: -0.5491 0.1268 0.4223 13.0323 -1.1213 -11.0802
hfenergy: -775.7846172 hartree
pointgroup: C01 [X(C11H12F2O2)]
dipole: 1.4694002 0.2299822 0.2397299 debye
polarizability: 192.5069703|-4.5529193|197.2085412|-0.4425935|16.7957146|153.6755236 unknown
InChI: InChI=1S/C11H12F2O2/c1-8(14)15-10(7-11(12)13)9-5-3-2-4-6-9/h2-6,10-11H,7H2,1H3
charge 0 multiplicity 1
27 atoms
C  1.3606964 4.23915554 0.83344154
C  1.08048856 2.94582468 0.39382269
C  2.11743181 2.041249 0.15434941
C  3.44050252 2.44432539 0.35560183
C  3.72161385 3.73995318 0.78724781
C  2.68269244 4.63963003 1.02993479
H  0.54648765 4.93611077 1.01411666
H  0.05038687 2.6366844 0.22918806
H  4.25219848 1.74623919 0.16683242
H  4.75378455 4.04674753 0.93571834
H  2.9027794 5.64925683 1.36680706
C  1.79519318 0.62746482 -0.26766613
H  0.81809765 0.60868413 -0.75952956
C  1.80595464 -0.3253143 0.92003871
H  2.80156981 -0.34122288 1.37623158
H  1.08963808 0.02849477 1.66873188
C  1.43990214 -1.73394306 0.54298224
H  2.09291992 -2.20635891 -0.19427237
F  1.43872777 -2.52446579 1.6700135
F  0.15405401 -1.77870716 0.04818856
O  2.78341173 0.11977594 -1.18710834
C  2.69316098 0.51542851 -2.47087313
O  1.81114374 1.24103646 -2.88162409
C  3.81298641 -0.04447679 -3.28697245
H  3.63520157 0.152187 -4.34427754
H  4.75009847 0.43271788 -2.98012812
H  3.91506832 -1.11912185 -3.1126693
