program: Gaussian 16
title: Title Card Required
version: ES64L-G16RevB.01
frameworkgroup: C1[X(C11H12F2O2)]
method: RPBE1PBE
basis: 6-31+G(d,p)
operation: Freq
keyword: #P
keyword: Geom=AllCheck
keyword: Guess=TCheck
keyword: SCRF=Check
keyword: GenChk
keyword: RPBE1PBE/6-31+G(d,p)
keyword: Freq
converged: YES YES YES YES
title: Mulliken charges:
elementType: C C C C C C H H H H H C H C H H C H F F O C O C H H H
charge: -0.230028 0.256018 0.581232 -0.615807 -0.443841 -0.171751 0.194732 0.185420 0.180991 0.194969 0.193683 -0.264092 0.228441 -0.404954 0.227920 0.229380 0.452502 0.189016 -0.312256 -0.302367 -0.159799 0.202783 -0.381335 -0.685758 0.210960 0.225596 0.218345
chargesum: -0.00000
title: Mulliken charges with hydrogens summed into heavy atoms:
elementType: C C C C C C C C C F F O C O C
charge: -0.035296 0.441437 0.581232 -0.434816 -0.248873 0.021932 -0.035651 0.052345 0.641518 -0.312256 -0.302367 -0.159799 0.202783 -0.381335 -0.030856
chargesum: 0.00000
polarizability: 1.98684024e+02 -5.08034937e+00 1.94567455e+02 -2.34518927e+01 4.28419405e+00 1.51367825e+02
1716.lowfreq: -22.1618 -6.9675 0.0005 0.0006 0.0008 12.4290 38.9655 59.3867 67.8469
frequency: 38.2391 59.2518 67.7867 86.6159 96.2173 101.7109 109.4607 159.7372 195.4642 208.7355 289.8485 315.6967 409.7572 414.5747 436.2167 444.7095 491.3214 518.1282 585.9903 614.1008 628.3934 681.2783 710.7895 732.0382 757.1177 836.8316 861.7628 862.7168 904.4853 926.7227 950.3171 987.5772 996.1451 1011.4205 1015.3799 1034.1518 1053.1928 1055.7996 1074.4545 1102.6393 1129.6379 1163.0520 1173.9625 1207.0948 1227.2399 1260.2882 1284.0576 1341.2022 1364.9455 1379.9374 1385.5417 1396.4595 1408.5321 1421.0346 1437.9966 1447.1826 1451.5237 1454.1899 1486.3300 1538.6167 1653.7380 1675.9458 1822.4026 3080.7345 3086.5781 3100.0751 3141.8976 3148.8147 3162.7002 3202.8417 3203.9667 3209.7608 3218.4442 3229.3726 3244.2449
redmass: 5.3465 3.5959 3.8078 3.2002 1.4379 5.9422 11.2942 9.1383 5.5500 5.8013 7.6025 3.7710 2.1080 2.8959 5.0396 3.4876 3.5183 7.5026 4.6881 2.7255 6.3466 4.3749 1.9106 4.6786 2.0911 3.3492 2.1929 1.5045 3.1833 2.4085 1.9234 3.2405 1.3711 1.2934 5.4827 1.8518 3.1707 1.8708 2.2318 2.3796 2.2116 2.7116 1.0696 1.1333 1.8630 2.5696 1.1905 1.6268 1.5474 1.9946 1.9093 1.2538 1.5897 1.3751 1.5292 1.0549 1.1452 1.0511 2.3602 2.3718 6.0907 6.0587 11.4350 1.0376 1.0814 1.0678 1.0887 1.1009 1.1012 1.0868 1.1051 1.0889 1.0939 1.0980 1.0937
irintensity: 0.8146 3.5090 6.3940 5.6090 1.9341 0.8223 2.5327 1.9978 3.0190 4.6185 1.9727 5.5461 4.0441 1.3807 30.7649 6.7728 25.1470 10.1330 28.9650 17.3786 0.4626 13.4204 78.0256 19.5195 49.2135 50.4396 17.3733 2.7947 0.6877 23.2189 12.0865 22.0842 0.4045 0.6656 7.4277 7.3706 178.6477 43.9792 119.5365 157.3842 149.1451 69.4266 0.4843 3.3566 21.5241 439.1034 16.2037 40.7885 55.5924 36.6449 38.4223 22.5497 185.6421 20.1602 30.4559 27.1625 31.6754 19.7274 16.9066 14.1271 1.4476 6.4747 464.9868 0.7686 7.0428 5.0111 40.4465 3.0819 1.7130 2.6084 5.7029 1.2059 24.5914 21.4806 7.7353
temp: 298.150 k
press: 1.00000 atm
elementType: 6 6 6 6 6 6 1 1 1 1 1 6 1 6 1 1 6 1 9 9 8 6 8 6 1 1 1
symmnumber: 1
zpe: 562048.2 jmol-1
zpe.correction: 0.214073 hartree
zpe.thermalcorrener: 0.228214 hartree
zpe.thermalcorrenthalpy: 0.229158 hartree
zpe.thermalcorrgfe: 0.171740 hartree
zpe.sumelectzpe: -775.554656 hartree
zpe.sumelectthermal: -775.540515 hartree
zpe.sumelectthermalent: -775.539571 hartree
zpe.sumelectthermalfe: -775.596990 hartree
dipole: -0.4603 -0.7540 5.2748
dipole: 5.3483
quadrupole: -80.7614 -70.4528 -91.0205
quadrupole: 0.3565 -7.0149 -3.8488
quadrupole: -0.0165 10.2921 -10.2756 0.3565 -7.0149 -3.8488
hfenergy: -775.7687292 hartree
pointgroup: C01 [X(C11H12F2O2)]
dipole: 0.7856449 -1.8846658 0.5082807 debye
polarizability: 187.0274871|23.1711481|183.108254|-11.5979705|23.844371|174.4835624 unknown
InChI: InChI=1S/C11H12F2O2/c1-8(14)15-10(7-11(12)13)9-5-3-2-4-6-9/h2-6,10-11H,7H2,1H3
charge 0 multiplicity 1
27 atoms
C  -0.51110157 3.90376658 3.09846856
C  -0.88639966 2.82240197 2.30730591
C  -0.15730183 2.48305611 1.15992761
C  0.97544279 3.23421143 0.84171866
C  1.35745946 4.31610166 1.63812876
C  0.61539037 4.6592422 2.7656732
H  -1.09687672 4.15535718 3.97893861
H  -1.76327841 2.23926633 2.5787982
H  1.56839098 2.9926146 -0.03375341
H  2.2391585 4.8920874 1.36872674
H  0.91176317 5.50356965 3.3824561
C  -0.55180566 1.23094568 0.39866777
H  -0.28554978 0.39620552 1.05714593
C  0.15937535 0.89875702 -0.91314692
H  1.23896339 0.93248214 -0.7336911
H  -0.06922707 -0.14540131 -1.15323542
C  -0.10304527 1.65911197 -2.18662635
H  0.53840602 1.30448593 -2.9989548
F  -1.40678019 1.49952965 -2.60763237
F  0.10006024 3.0101792 -2.06689057
O  -1.98206595 1.047334 0.28806648
C  -2.79084579 2.03536823 -0.13828719
O  -2.41523599 3.14889258 -0.42971981
C  -4.20847915 1.5563154 -0.19631519
H  -4.86873799 2.3882861 -0.44200171
H  -4.29665614 0.7794463 -0.96315179
H  -4.50069884 1.11317243 0.76013763
