program: Gaussian 09
title: 000048089
version: EM64L-G09RevD.01
frameworkgroup: C1[X(C22H25NO5)]
method: RPBEPBE
basis: SDD
operation: Freq
keyword: #p
keyword: freq=noraman
keyword: PBEPBE/SDD
title: #p freq=noraman PBEPBE/SDD
converged: YES YES NO NO
title: Mulliken charges:
elementType: O O O O O N C C C C C C C C C C C C C C C C C C C C C C H H H H H H H H H H H H H H H H H H H H H H H H H
charge: -0.246746 -0.259303 -0.278971 -0.222997 -0.241662 -0.099410 -0.351026 -0.339933 -0.358963 -0.313976 -0.318676 -0.017759 -0.264395 0.421139 0.290405 0.218118 -0.342259 -0.386180 -0.361486 -0.351761 -0.257207 -0.223138 -0.250737 -0.237811 0.331190 -0.241628 -0.245375 -0.764995 0.213714 0.192201 0.207713 0.197005 0.203239 0.218819 0.214742 0.194870 0.195587 0.215792 0.232905 0.246173 0.271750 0.270487 0.256294 0.268566 0.227967 0.226476 0.226662 0.229645 0.228883 0.229600 0.252867 0.246245 0.247339
chargesum: 0.00000
title: Mulliken charges with hydrogens summed into heavy atoms:
elementType: O O O O O N C C C C C C C C C C C C C C C C C C C C C C
charge: -0.246746 -0.259303 -0.278971 -0.222997 -0.241662 -0.099410 0.054888 0.064785 0.063096 0.095636 0.092703 -0.017759 0.214683 0.421139 0.290405 0.218118 -0.070509 -0.115693 -0.105192 -0.083194 -0.029240 0.003338 -0.024075 -0.008166 0.331190 -0.012745 -0.015775 -0.018544
polarizability: 2.73103638e+02 4.30253077e-01 2.60002173e+02 2.19019488e+01 1.33214920e+01 2.25471705e+02
1716.lowfreq: -5.3560 0.0006 0.0007 0.0009 1.8657 6.8632 11.8163 24.6612 26.1111
frequency: 11.7486 24.1720 26.0495 36.1122 42.0983 49.5380 55.6705 67.8270 72.1549 75.9043 88.2615 97.6182 114.1114 120.8949 144.4455 171.6442 188.7464 217.3653 237.5803 242.9475 246.7330 267.5594 284.9020 301.0937 310.6305 319.7976 334.1020 365.1366 386.4648 400.4305 405.4613 412.3998 468.8222 470.8905 481.3201 497.6752 541.0234 565.8231 597.3710 605.8366 615.0238 617.3396 652.5015 665.4597 690.1357 701.0373 706.9647 752.1268 762.3345 770.9816 786.8046 795.4808 812.6996 841.2984 847.0373 852.1369 860.4414 882.9720 899.9012 923.9032 931.1579 935.6992 950.9994 978.2064 980.2483 987.4299 990.4624 993.0395 994.9220 997.3065 1000.6348 1002.3749 1027.8063 1030.7014 1033.1065 1041.2339 1051.7975 1059.3802 1081.7041 1086.9078 1091.7414 1094.6199 1109.4159 1137.2700 1147.7382 1154.1966 1171.7535 1174.6740 1176.6935 1190.2705 1193.0235 1201.6013 1206.5305 1213.3691 1230.5147 1252.1445 1269.0916 1287.2694 1293.9045 1317.9744 1319.9427 1330.5149 1333.9969 1349.1538 1365.7068 1372.2291 1378.4305 1380.2844 1382.6327 1398.7497 1434.2839 1437.5213 1443.3935 1449.4293 1451.9105 1452.4190 1454.1570 1460.4334 1469.3517 1479.9016 1481.2472 1484.9622 1589.1495 1593.1514 1608.7828 1612.1865 1627.6119 1650.4132 2865.0628 2872.1280 2898.3804 2957.1113 2960.9073 3007.2435 3021.0787 3029.4694 3037.0383 3044.0196 3081.5667 3085.0376 3096.2574 3096.4937 3124.8934 3126.0983 3135.3497 3135.4838 3142.5521 3147.7285 3147.9381 3162.1970 3162.7537 3183.4230 3196.9652
redmass: 5.6637 2.9336 4.4619 4.5368 4.1793 1.8610 3.2937 3.1568 2.9628 3.3067 3.4027 5.1133 2.8244 5.3917 6.9442 4.6579 5.6336 5.4688 2.4601 5.9109 2.9108 4.2703 4.3808 6.3574 4.1134 2.7961 4.7335 4.8625 2.4117 2.8349 2.8064 2.9832 2.8770 4.2731 5.1330 3.9591 3.8628 3.3786 2.5764 3.6248 6.3174 6.4003 6.0884 6.6199 6.2355 1.6460 1.8248 4.0859 2.3558 2.1719 2.2228 1.7641 2.9091 1.6001 2.9740 1.5529 1.2461 5.2944 2.3882 1.9702 5.9987 1.5392 3.7532 1.5670 3.9626 1.3978 5.8191 4.9510 2.0714 1.3475 1.4537 2.3397 2.1716 2.1684 2.1915 1.6633 2.3829 1.7958 2.7080 1.6079 1.6538 3.4667 2.3160 2.5044 3.2721 2.2612 1.3494 1.0719 1.9153 1.0650 1.1667 1.1707 1.3272 3.8725 4.2594 1.3332 1.2702 1.2339 1.2954 1.3279 1.3259 1.3268 1.2448 1.3092 1.4586 1.2681 7.5272 1.2474 9.2000 1.4908 2.2243 2.2392 1.0834 1.0795 1.0958 1.0617 1.0477 1.0962 1.0822 2.2001 1.0865 2.1684 6.0200 6.3055 6.1096 5.9259 11.4690 9.7011 1.0705 1.0694 1.0696 1.0664 1.0665 1.0365 1.0591 1.0898 1.0890 1.0892 1.0965 1.0980 1.1068 1.0989 1.0849 1.0850 1.0890 1.0889 1.1010 1.0943 1.0943 1.1000 1.0994 1.0950 1.0945
irintensity: 0.0217 0.0273 0.0807 0.0339 0.1158 2.0708 0.9709 0.4561 1.6193 1.4556 1.4224 0.7754 2.1946 3.3117 0.1052 1.1070 1.1637 1.2761 3.2943 7.7222 0.9241 14.2370 3.2091 7.7386 1.1863 10.4110 0.9914 3.2221 7.5305 0.0681 0.0740 19.7276 1.5247 1.5760 2.0653 10.5636 21.3150 2.7303 14.1974 8.8174 0.6611 1.3092 10.1528 9.5771 5.4926 51.3029 54.3217 23.1184 53.5306 30.1808 14.6366 5.0882 20.6290 0.3512 9.5422 0.9011 0.2404 13.5138 6.1683 43.5620 9.0902 24.4745 79.4947 24.5852 121.4372 1.5720 1.3506 3.8410 28.0677 0.7723 3.9032 64.2031 8.8252 8.5760 5.0622 7.7211 21.9575 4.9602 15.0765 9.2419 15.4205 56.7634 6.3189 74.4912 288.6243 79.8877 35.6507 1.2615 59.3315 2.2437 2.8833 9.0991 6.4703 223.5114 16.0923 18.9876 5.4908 16.1400 3.1874 7.6501 3.1270 1.8845 2.1159 4.7059 2.2133 2.3258 0.0716 55.2616 0.7816 2.6440 19.9960 8.3724 3.5458 0.8765 17.9288 24.2298 19.1665 4.8101 4.9880 19.5436 12.3064 16.4832 1.1886 0.9663 14.6322 1.2717 148.4707 130.3303 46.5435 85.2131 91.3300 30.6438 98.1845 2.4176 15.6213 35.6559 35.5105 21.7665 40.0479 33.2980 25.9746 5.1021 0.1075 0.3407 7.6134 8.4025 8.8959 23.4495 30.6870 30.0686 25.6679 6.1269 1.6737
temp: 298.150 k
press: 1.00000 atm
elementType: 8 8 8 8 8 7 6 6 6 6 6 6 6 6 6 6 6 6 6 6 6 6 6 6 6 6 6 6 1 1 1 1 1 1 1 1 1 1 1 1 1 1 1 1 1 1 1 1 1 1 1 1 1
symmnumber: 1
zpe: 1120679.5 jmol-1
zpe.correction: 0.426844 hartree
zpe.thermalcorrener: 0.453695 hartree
zpe.thermalcorrenthalpy: 0.454639 hartree
zpe.thermalcorrgfe: 0.365811 hartree
zpe.sumelectzpe: -1282.114945 hartree
zpe.sumelectthermal: -1282.088095 hartree
zpe.sumelectthermalent: -1282.087151 hartree
zpe.sumelectthermalfe: -1282.175979 hartree
dipole: -1.1116 1.0138 2.9088
dipole: 3.2749
quadrupole: -170.3914 -155.5365 -155.3722
quadrupole: -4.4872 2.5407 -4.5327
quadrupole: -9.9581 4.8969 5.0612 -4.4872 2.5407 -4.5327
hfenergy: -1282.5417894 hartree
pointgroup: C01 [X(C22H25N1O5)]
dipole: 0.4639592 -0.4794524 1.1022435 debye
polarizability: 271.7887998|1.3870153|261.5516325|-23.4198964|-10.6751875|225.2370827 unknown
InChI: InChI=1S/C22H25NO5/c1-18(24)28-22(19-8-4-2-5-9-19,20-10-6-3-7-11-20)21(25)27-17-14-23-12-15-26-16-13-23/h2-11H,12-17H2,1H3
charge 0 multiplicity 1
53 atoms
O  -7.354553 -0.01155 -0.341072
O  -0.781794 0.312381 0.163514
O  1.552848 0.48111 1.509146
O  0.237372 0.542482 -1.913962
O  0.911109 2.617734 0.813583
N  -4.517758 0.480846 0.046799
C  -5.51988 0.906931 1.057947
C  -5.000511 -0.722648 -0.681711
C  -3.156296 0.31689 0.606944
C  -6.867698 1.181839 0.371317
C  -6.35759 -0.428176 -1.341209
C  1.620653 -0.002276 0.082656
C  -2.103492 0.567528 -0.478801
C  2.904178 0.557804 -0.548495
C  1.607935 -1.543586 0.165147
C  0.316501 0.365817 -0.679668
C  2.915704 1.710063 -1.373291
C  1.280562 -2.226488 1.359121
C  4.137048 -0.057666 -0.207653
C  1.874252 -2.283984 -1.014495
C  4.13848 2.223203 -1.858445
C  1.238604 -3.639446 1.377042
C  5.357895 0.46193 -0.685538
C  1.822965 -3.693717 -0.994829
C  1.223631 1.82504 1.727984
C  5.362767 1.604925 -1.518254
C  1.508078 -4.378142 0.202678
C  1.307973 2.143164 3.203263
H  -5.163801 1.832276 1.548783
H  -5.667077 0.128555 1.848659
H  -4.270955 -1.001678 -1.464267
H  -5.11102 -1.595245 0.01075
H  -2.993976 -0.692512 1.055855
H  -3.012677 1.05906 1.4131
H  -7.649218 1.424287 1.110233
H  -6.753258 2.024537 -0.344196
H  -6.234956 0.370516 -2.104162
H  -6.774134 -1.332947 -1.813803
H  -2.209135 -0.10775 -1.346252
H  -2.133049 1.610529 -0.836763
H  1.978591 2.201819 -1.639554
H  1.068676 -1.651696 2.263536
H  4.138155 -0.94628 0.433072
H  2.11781 -1.756125 -1.943291
H  4.132647 3.110624 -2.500846
H  0.993671 -4.161522 2.3089
H  6.300779 -0.024918 -0.412814
H  2.030152 -4.256125 -1.911902
H  6.309068 2.007955 -1.896659
H  1.472516 -5.473226 0.218914
H  2.341462 1.995374 3.562044
H  1.002289 3.185269 3.374028
H  0.657655 1.461522 3.778121
