program: Gaussian 16
title: Title Card Required
version: ES64L-G16RevB.01
frameworkgroup: CS[SG(CH),X(F2)]
method: UPBE1PBE
basis: 6-31+G(d,p)
operation: Freq
keyword: #P
keyword: Geom=AllCheck
keyword: Guess=TCheck
keyword: SCRF=Check
keyword: GenChk
keyword: UPBE1PBE/6-31+G(d,p)
keyword: Freq
converged: YES YES YES YES
polarizability: 1.45312037e+01 -1.17018672e+00 1.73789621e+01 8.43985037e-14 -1.99720403e-13 1.91830368e+01
1716.lowfreq: -41.9012 -11.8449 -0.0023 -0.0017 -0.0010 20.7386 541.4989 995.6073 1152.4309
frequency: 541.4988 995.6064 1152.4306 1160.4326 1334.4360 3194.9168
redmass: 15.1197 1.4188 4.8473 9.2538 1.2522 1.0892
irintensity: 8.1332 13.1713 410.4447 152.2971 50.2753 8.1679
temp: 298.150 k
press: 1.00000 atm
elementType: 6 1 9 9
symmnumber: 1
zpe: 50119.5 jmol-1
zpe.correction: 0.019089 hartree
zpe.thermalcorrener: 0.022204 hartree
zpe.thermalcorrenthalpy: 0.023149 hartree
zpe.thermalcorrgfe: -0.005952 hartree
zpe.sumelectzpe: -238.077732 hartree
zpe.sumelectthermal: -238.074617 hartree
zpe.sumelectthermalent: -238.073673 hartree
zpe.sumelectthermalfe: -238.102773 hartree
dipole: -0.9556 1.6941 0.0000
dipole: 1.9451
quadrupole: -15.4227 -14.6382 -18.1220
quadrupole: -1.2246 0.0000 0.0000
quadrupole: 0.6382 1.4228 -2.0610 -1.2246 0.0000 0.0000
hfenergy: -238.0968212 hartree
pointgroup: CS [SG(C1H1),X(F2)]
dipole: 0.3599013 -0.6388727 -0.2188786 debye
dipolederiv: 1.6846671 0.1193114 0.4175125 0.1116062 0.7482556 0.5303249 0.4219609 0.5177422 0.9945503 0.0818131 -0.0278687 -0.0203709 0.0467791 0.039471 -0.0648351 -0.0634673 0.0570648 0.1301828 -1.3055191 0.011847 -0.207475 0.0523834 -0.2742126 -0.0638976 0.0652585 -0.0742861 -0.2597382 -0.4609611 -0.1032897 -0.1896666 -0.2107687 -0.5135139 -0.4015922 -0.4237521 -0.5005209 -0.8649949 unknown
polarizability: 18.4897681|-0.2306609|16.5737537|1.2652752|1.8830859|16.0296809 unknown
InChI: InChI=1S/CHF2/c2-1-3/h1H
charge 0 multiplicity 2
4 atoms
C  -0.54871502 -0.3609 0.0485422
H  -0.13946309 -1.36797851 -0.03834984
F  -1.88183789 -0.29809618 -0.00293135
F  -0.09190216 0.33471651 1.09317138
