program: Gaussian 09
title: 000047917
version: EM64L-G09RevD.01
frameworkgroup: C1[X(C10H14N2O2)]
method: RPBEPBE
basis: SDD
operation: Freq
keyword: #p
keyword: freq=noraman
keyword: PBEPBE/SDD
title: #p freq=noraman PBEPBE/SDD
converged: YES YES NO NO
title: Mulliken charges:
elementType: O O N N C C C C C C C C C C H H H H H H H H H H H H H H
charge: -0.449447 -0.449444 -0.071541 -0.071558 -0.252651 -0.266075 -0.252657 -0.266079 -0.449471 -0.451770 -0.451804 -0.453252 0.139540 0.139579 0.251127 0.288045 0.251122 0.288038 0.224282 0.224248 0.225082 0.225136 0.225077 0.225160 0.225891 0.225911 0.363756 0.363756
chargesum: 0.00000
title: Mulliken charges with hydrogens summed into heavy atoms:
elementType: O O N N C C C C C C C C C C
charge: -0.085691 -0.085688 -0.071541 -0.071558 -0.001524 0.021970 -0.001536 0.021959 -0.000941 -0.001552 -0.001567 -0.001450 0.139540 0.139579
polarizability: 1.68543476e+02 -5.83363902e-04 1.01840503e+02 1.97683430e-03 -5.14644785e-04 1.00084245e+02
1716.lowfreq: -48.7046 -40.4805 -29.4636 -0.0003 0.0004 0.0006 59.8187 61.6521 195.7739
frequency: 57.9753 60.5091 195.6276 206.8961 235.0925 261.7049 287.5520 321.6877 344.5733 349.6332 406.4197 407.1122 421.6813 435.2008 462.0245 530.3211 586.3505 594.9785 615.1245 690.8194 716.9091 721.1641 743.7181 804.1841 811.5447 846.3409 862.4853 871.8957 878.9673 905.5410 931.8715 981.7534 984.1087 1001.1746 1035.2994 1035.9616 1088.2182 1090.7379 1098.6579 1099.1117 1140.4128 1159.3401 1197.0366 1219.9909 1229.6758 1247.2879 1256.1115 1261.3243 1286.1702 1303.8033 1306.9598 1316.8997 1318.0389 1322.5375 1338.7916 1342.5025 1359.9961 1365.7641 1449.1000 1461.2415 1463.8720 1472.7110 1621.9711 1624.2470 2984.6672 2985.5916 2986.2571 2988.2273 3038.2060 3041.8576 3043.1220 3047.3596 3048.2385 3051.3936 3064.6500 3066.9450 3571.5274 3571.6513
redmass: 5.7290 5.3607 5.0439 4.3676 2.9781 7.4342 4.8710 2.6522 2.5358 2.5516 1.7843 1.5220 1.2234 2.4883 4.6035 4.9783 5.6957 6.5314 5.3104 4.7479 3.5445 3.6954 3.2776 4.1699 3.8249 3.0836 4.6423 1.5628 3.7270 2.2958 2.2941 1.9176 1.8988 5.2495 2.3149 2.2652 1.5523 1.5391 1.2421 1.2763 1.0310 2.0921 1.0627 1.3129 1.3742 1.7859 1.5397 1.6457 1.4157 1.5189 1.7942 1.6888 1.5112 1.3421 1.4491 1.4707 1.6080 1.7244 1.0778 1.0897 1.0888 1.0888 7.6934 7.6804 1.0594 1.0599 1.0604 1.0607 1.0852 1.0867 1.1043 1.1040 1.1040 1.1039 1.0852 1.0875 1.0674 1.0675
irintensity: 0.0310 0.0261 0.0273 0.0944 0.5872 1.0301 3.7214 0.4343 2.9854 24.7953 0.8841 97.5351 124.5930 41.1826 20.4911 11.2262 4.3695 0.0340 6.0794 1.0004 1.1562 1.0013 3.5865 17.5117 119.6615 0.3194 154.7714 0.3161 17.5715 0.0164 68.0977 8.8502 12.3774 2.6418 8.5427 9.1936 9.4352 1.7307 2.5276 2.0978 0.0000 0.0059 12.2542 77.2353 16.4547 9.6488 3.6116 0.3400 15.6775 13.4907 2.9005 3.3590 0.1766 0.1726 0.4312 0.5365 14.0484 7.4527 0.0196 19.1420 17.7753 1.2532 15.6883 0.3495 9.2887 70.4391 42.3652 18.4652 43.7275 33.3079 0.5040 27.1247 30.5507 48.8386 11.4763 7.4021 75.3610 3.8057
temp: 298.150 k
press: 1.00000 atm
elementType: 8 8 7 7 6 6 6 6 6 6 6 6 6 6 1 1 1 1 1 1 1 1 1 1 1 1 1 1
symmnumber: 1
zpe: 607322.6 jmol-1
zpe.correction: 0.231317 hartree
zpe.thermalcorrener: 0.243008 hartree
zpe.thermalcorrenthalpy: 0.243952 hartree
zpe.thermalcorrgfe: 0.194142 hartree
zpe.sumelectzpe: -648.262947 hartree
zpe.sumelectthermal: -648.251256 hartree
zpe.sumelectthermalent: -648.250312 hartree
zpe.sumelectthermalfe: -648.300122 hartree
dipole: 0.0000 0.1485 -0.0005
dipole: 0.1485
quadrupole: -77.8406 -81.4488 -81.7506
quadrupole: -0.0027 0.3702 0.0003
quadrupole: 2.5060 -1.1021 -1.4039 -0.0027 0.3702 0.0003
hfenergy: -648.4942643 hartree
pointgroup: C01 [X(C10H14N2O2)]
dipole: -0.0000079 -0.0584402 0.0000814 debye
polarizability: 168.5407221|0.0030131|101.8404968|-0.4342189|0.0033443|100.0870051 unknown
InChI: InChI=1S/C10H14N2O2/c13-11-9-5-1-6-3-8(9)4-7(2-5)10(6)12-14/h5-8,13-14H,1-4H2
charge 0 multiplicity 1
28 atoms
O  3.770894 0.779777 -0.328687
O  -3.771011 0.777706 0.332643
N  2.993906 -0.177566 0.500854
N  -2.993748 -0.174835 -0.502122
C  0.778632 -1.018661 1.005006
C  1.011272 0.792298 -0.780258
C  -0.778529 -1.013415 -1.010209
C  -1.011412 0.788009 0.78475
C  -0.000049 -1.915529 -0.004829
C  -0.233749 -0.123291 1.783929
C  0.234077 -0.114005 -1.784322
C  -0.000176 1.685344 0.004517
C  1.713516 -0.106999 0.223745
C  -1.713434 -0.105828 -0.224245
H  1.363678 -1.639644 1.706331
H  1.748282 1.417495 -1.310449
H  -1.363545 -1.630732 -1.714777
H  -1.748495 1.410337 1.318209
H  0.703469 -2.566751 -0.558119
H  -0.70375 -2.569166 0.545383
H  -0.940516 -0.76297 2.346063
H  0.303139 0.509569 2.516339
H  0.941099 -0.750814 -2.349392
H  -0.302654 0.522385 -2.513787
H  -0.541363 2.340218 -0.704672
H  0.540821 2.336887 0.716907
H  4.693161 0.612813 -0.006295
H  -4.693215 0.612266 0.009289
