program: Gaussian 09
title: 000047918
version: EM64L-G09RevD.01
frameworkgroup: C1[X(C10H14N2O2)]
method: RPBEPBE
basis: SDD
operation: Freq
keyword: #p
keyword: freq=noraman
keyword: PBEPBE/SDD
title: #p freq=noraman PBEPBE/SDD
converged: NO YES NO NO
title: Mulliken charges:
elementType: O O N N C C C C C C C C C C H H H H H H H H H H H H H H
charge: -0.174800 -0.174848 0.006249 0.006226 0.212824 0.212768 -0.093801 -0.090518 -0.590088 -0.509604 -0.514426 -0.509550 -0.514422 -0.447404 0.217354 0.224578 0.256949 0.247055 0.228024 0.226636 0.231246 0.226197 0.226629 0.228012 0.226194 0.231242 0.205640 0.205637
chargesum: 0.00000
title: Mulliken charges with hydrogens summed into heavy atoms:
elementType: O O N N C C C C C C C C C C
charge: -0.174800 -0.174848 0.006249 0.006226 0.212824 0.212768 0.123553 0.134060 -0.086083 -0.054944 -0.056983 -0.054908 -0.056987 -0.036127
polarizability: 1.69673859e+02 -6.06481337e-04 1.12143308e+02 -6.72611860e-04 -2.74650124e+00 1.05696410e+02
1716.lowfreq: -0.0005 0.0006 0.0007 14.0769 33.2623 40.0870 55.5106 85.6897 177.2608
frequency: 55.4678 84.3956 177.2097 193.5433 254.6517 280.5921 309.0423 314.1784 352.3029 365.3655 387.0796 391.6412 415.3183 423.0166 455.6437 480.0722 641.8537 646.4274 665.2061 705.8379 741.3062 784.3699 817.9217 842.2906 846.0834 871.9354 880.0750 888.4845 945.6512 952.2815 960.6070 979.4992 980.2228 1020.9814 1047.6274 1054.5443 1054.6489 1099.5063 1106.5688 1108.3421 1127.8339 1165.4414 1230.3836 1237.4318 1261.5901 1261.7991 1280.0285 1285.5632 1288.1115 1288.1765 1312.5719 1312.8868 1323.1915 1333.0140 1349.3368 1349.4374 1394.5775 1403.9867 1451.0430 1454.1276 1460.7996 1463.2620 1468.0719 1484.7285 2975.2743 2988.2545 2991.4839 2992.6393 2995.3749 2998.5658 3009.1461 3017.6238 3034.6157 3050.7925 3053.7409 3056.7871 3059.7457 3066.7686
redmass: 13.1155 7.4711 6.0469 3.7710 2.9322 5.6898 3.0456 3.2874 4.3031 3.0389 4.2994 4.7451 3.1284 1.8208 1.8848 1.9811 4.4012 4.5702 6.7204 6.1383 3.8388 4.1117 3.4051 2.7662 4.9701 1.5915 1.5524 1.5758 2.1625 2.3951 2.4554 1.9889 2.1493 1.8669 3.1439 1.6801 2.5501 1.0248 1.4588 1.1407 1.7127 1.0721 1.7900 1.8052 2.1356 1.5565 1.5520 1.5524 1.9286 1.7736 1.5185 1.6983 1.4813 1.4893 1.6304 1.6103 5.9645 8.9158 1.0813 1.0811 1.0902 1.0875 1.0947 1.0927 1.0620 1.0655 1.0636 1.0588 1.0600 1.0605 1.0787 1.0814 1.1032 1.1026 1.1027 1.1035 1.1034 1.1034
irintensity: 0.9321 0.0611 4.9194 0.0048 0.4661 8.0698 0.5230 0.4948 0.8200 0.1830 0.1556 0.9387 0.3663 0.0470 0.2733 0.9224 0.3481 2.7912 16.3613 5.4693 7.4916 1.7321 12.1197 7.4703 119.6376 1.0111 1.7637 0.2896 0.6270 37.7155 8.8240 1.1823 3.0324 0.0822 0.2407 0.9535 1.2828 1.2545 14.1364 4.3488 4.5388 1.8318 0.6146 3.2536 1.0090 12.6655 5.0021 16.6205 1.2630 6.6833 0.8184 5.1062 30.4899 5.3041 0.5904 0.8038 341.5128 57.0091 0.1423 0.0767 21.3049 20.2138 14.1550 0.4586 23.5090 3.5325 3.9889 3.3922 35.5792 24.9416 99.8169 50.2249 20.0020 5.2620 15.0714 26.0694 39.9962 22.7982
temp: 298.150 k
press: 1.00000 atm
elementType: 8 8 7 7 6 6 6 6 6 6 6 6 6 6 1 1 1 1 1 1 1 1 1 1 1 1 1 1
symmnumber: 1
zpe: 603276.8 jmol-1
zpe.correction: 0.229776 hartree
zpe.thermalcorrener: 0.241262 hartree
zpe.thermalcorrenthalpy: 0.242206 hartree
zpe.thermalcorrgfe: 0.192874 hartree
zpe.sumelectzpe: -648.211589 hartree
zpe.sumelectthermal: -648.200103 hartree
zpe.sumelectthermalent: -648.199159 hartree
zpe.sumelectthermalfe: -648.248491 hartree
dipole: 0.0008 3.8990 0.0421
dipole: 3.8992
quadrupole: -103.3710 -83.8257 -80.8497
quadrupole: -0.0009 0.0001 -1.9234
quadrupole: -14.0222 5.5231 8.4991 -0.0009 0.0001 -1.9234
hfenergy: -648.4413651 hartree
pointgroup: C01 [X(C10H14N2O2)]
dipole: -0.0002848 1.4993893 0.3243802 debye
polarizability: 169.6738587|-0.0016996|110.636545|0.0025784|3.8712897|107.2031733 unknown
InChI: InChI=1S/C10H14N2O2/c13-11-9-2-7-1-8(4-9)5-10(3-7,6-9)12-14/h7-8H,1-6H2
charge 0 multiplicity 1
28 atoms
O  -3.287754 -1.31814 -0.756299
O  3.287794 -1.318388 -0.756056
N  -2.442133 -1.369872 0.192121
N  2.442159 -1.369742 0.192426
C  -1.257918 -0.412065 0.035279
C  1.258131 -0.411879 0.035508
C  -0.000006 1.363631 -1.218788
C  -0.000142 1.357724 1.319376
C  0.000103 -1.330779 0.052058
C  -1.272215 0.469706 -1.227666
C  -1.268937 0.46351 1.32568
C  1.272302 0.469871 -1.227536
C  1.268751 0.463641 1.325836
C  -0.000155 2.255863 0.053471
H  -0.000026 2.0049 -2.120801
H  -0.000261 1.985249 2.231441
H  0.000102 -1.976304 0.949191
H  0.000312 -1.984187 -0.840474
H  -2.187266 1.090916 -1.244984
H  -1.301515 -0.164378 -2.133834
H  -1.293311 -0.18633 2.220181
H  -2.180593 1.089854 1.337569
H  1.301775 -0.164291 -2.133641
H  2.18729 1.091175 -1.244796
H  2.180341 1.090086 1.337911
H  1.293082 -0.186124 2.220402
H  0.891116 2.913544 0.055652
H  -0.891526 2.913408 0.055574
