program: Gaussian 16
title: Scaling factors
version: ES64L-G16RevC.01
frameworkgroup: C*V[C*(HCN)]
method: RM062X
basis: CC-pVTZ
operation: Freq
keyword: #NGeom=AllCheck
keyword: Guess=TCheck
keyword: SCRF=Check
keyword: GenChk
keyword: RM062X/CC-pVTZ
keyword: Freq
converged: YES YES YES YES
title: Mulliken charges:
elementType: C H N
charge: -0.054258 0.146351 -0.092093
chargesum: -0.00000
title: Mulliken charges with hydrogens summed into heavy atoms:
elementType: C N
charge: 0.092093 -0.092093
chargesum: 0.00000
1716.lowfreq: -10.5700 -10.5700 -0.0015 -0.0014 -0.0010 782.9103 782.9103 2255.1562 3475.0667
frequency: 782.9103 782.9103 2255.1562 3475.0667
redmass: 1.3457 1.3457 4.8730 1.2038
irintensity: 34.9125 34.9125 2.7950 66.1328
temp: 298.150 k
press: 1.00000 atm
elementType: 6 1 7
symmnumber: 1
zpe: 43640.0 jmol-1
zpe.correction: 0.016622 hartree
zpe.thermalcorrener: 0.019149 hartree
zpe.thermalcorrenthalpy: 0.020093 hartree
zpe.thermalcorrgfe: -0.002727 hartree
zpe.sumelectzpe: -93.406039 hartree
zpe.sumelectthermal: -93.403512 hartree
zpe.sumelectthermalent: -93.402567 hartree
zpe.sumelectthermalfe: -93.425388 hartree
dipole: 0.0000 0.0000 -3.0335
dipole: 3.0335
quadrupole: -11.7170 -11.7170 -9.6316
quadrupole: 0.0000 0.0000 0.0000
quadrupole: -0.6951 -0.6951 1.3903 0.0000 0.0000 0.0000
hfenergy: -93.4226608 hartree
pointgroup: C*V [C*(H1C1N1)]
dipole: 0. 0. -1.1934837 debye
dipolederiv: 0.0616875 0. 0. 0. 0.0616875 0. 0. 0. -0.2455719 0.2541012 0. 0. 0. 0.2541012 0. 0. 0. 0.2572596 -0.3157887 0. 0. 0. -0.3157887 0. 0. 0. -0.0116876 unknown
polarizability: 11.0279778|0.|11.0279778|0.|0.|21.1600216 unknown
InChI: InChI=1S/CHN/c1-2/h1H
charge 0 multiplicity 1
3 atoms
C  0.0000 0.0000 -0.4956296
H  0.0000 0.0000 -1.56150772
N  0.0000 0.0000 0.64693632
