program: Gaussian 09
title: 000046796
version: EM64L-G09RevD.01
frameworkgroup: C1[X(C13H20NO2)]
method: RPBEPBE
basis: SDD
operation: Freq
keyword: #p
keyword: freq=noraman
keyword: PBEPBE/SDD
title: #p freq=noraman PBEPBE/SDD
converged: YES YES NO NO
title: Mulliken charges:
elementType: O O N C C C C C C C C C C C C C H H H H H H H H H H H H H H H H H H H H
charge: -0.339183 -0.164671 -0.231025 0.368752 -0.599825 -0.582827 -0.570924 0.120937 -0.552411 0.394546 0.463022 -0.529382 -0.812667 -0.796761 0.246561 -0.732463 0.277000 0.266070 0.277833 0.271554 0.250019 0.316087 0.290357 0.254719 0.281329 0.269290 0.264490 0.236945 0.278149 0.252061 0.249496 0.257001 0.229091 0.274054 0.273826 0.248948
chargesum: 1.00000
title: Mulliken charges with hydrogens summed into heavy atoms:
elementType: O O N C C C C C C C C C C C C C
charge: -0.339183 -0.164671 -0.231025 0.368752 0.221078 0.254833 0.255482 0.120937 -0.283121 0.394546 0.463022 -0.264892 -0.045512 -0.061173 0.246561 0.064365
polarizability: 1.86343269e+02 3.30981369e+00 1.63180935e+02 -5.71192812e+00 1.53224637e-01 1.04308215e+02
1716.lowfreq: -12.4438 -3.9812 0.0005 0.0007 0.0007 5.7003 13.7805 45.1858 56.3036
frequency: 6.1712 45.1367 56.2652 67.0529 76.1278 84.3839 120.4879 166.4717 174.3745 186.3198 198.9970 207.9930 246.1635 260.7392 271.0487 306.1399 314.5578 332.7264 355.2270 371.5494 377.6926 418.9912 424.2434 472.4105 513.6068 537.8060 544.6748 562.8927 580.0185 590.1932 625.9346 682.6659 756.7573 772.7557 815.9776 854.4261 887.0393 912.1763 917.9058 926.4718 973.1333 982.0354 998.6172 1028.6072 1034.1399 1040.8532 1047.2792 1054.8835 1101.9437 1107.6965 1108.2535 1142.5893 1207.8317 1210.1826 1219.0383 1240.6964 1256.8953 1299.3866 1370.7291 1389.1712 1402.7513 1406.4445 1412.4289 1413.9667 1419.2181 1445.1174 1446.3624 1447.3158 1449.4553 1455.4707 1466.4514 1467.2856 1471.1691 1473.9497 1477.8195 1481.1144 1489.5312 1493.4499 1508.8436 1580.9716 1620.2464 1706.0807 2990.1234 2991.0456 3007.1503 3027.0257 3033.0955 3040.0441 3072.3451 3074.3303 3095.8316 3097.4784 3105.3714 3141.5981 3142.2618 3144.4967 3145.2362 3150.3246 3159.5663 3166.1931 3181.4947 3198.9935
redmass: 1.0228 3.4644 3.5010 2.2781 1.3475 3.2624 3.0665 1.3637 1.4379 2.0103 2.9464 2.3111 1.1083 2.7782 2.6574 3.1633 3.5203 3.6776 1.0611 3.3881 3.8657 2.6389 2.7057 4.4820 3.6858 3.4067 3.3413 3.0543 4.5618 3.6360 4.6874 4.2909 5.3681 4.4218 6.5660 1.4517 3.9469 2.0370 1.5972 2.9646 3.3499 2.6080 1.5471 1.4554 1.6391 1.1938 1.5316 1.5822 1.7465 2.0031 1.4211 2.7703 1.7600 1.7488 1.7895 2.0243 1.7971 3.4321 6.5412 1.2147 1.2496 1.2730 1.2514 1.1935 1.7559 1.1268 1.1119 1.1171 1.1139 1.3737 1.0989 1.0619 1.0855 1.1016 1.1284 1.0988 1.0554 1.3353 1.0660 6.2327 6.4666 10.5891 1.0383 1.0380 1.0393 1.0320 1.0324 1.0349 1.0969 1.0973 1.0942 1.0998 1.0991 1.1053 1.0929 1.1050 1.1020 1.1051 1.1061 1.1058 1.0909 1.1009
irintensity: 0.8439 2.9842 1.2296 0.2476 0.1189 1.2361 5.3879 0.9047 1.1732 0.6698 2.7677 1.3441 0.1177 0.7785 1.2836 2.6612 4.0661 9.5413 0.4088 0.8729 4.4255 0.6537 0.8943 2.3094 1.7721 7.4813 4.6058 0.6214 7.8498 3.3905 28.8460 23.6371 18.2198 11.7522 126.7186 8.7092 26.1473 20.6170 2.5959 41.5777 38.1235 43.1622 12.5725 0.5577 12.1687 0.1142 4.1054 13.9979 76.8638 172.2111 46.6999 114.0922 4.4070 0.8773 1.3179 2.0704 8.6021 3.2107 6.8257 66.3846 19.9230 14.4639 8.8410 17.2488 16.8960 6.5117 6.0514 18.5957 30.7605 18.9082 16.8918 15.2497 15.2478 13.2144 34.4188 1.6320 29.7522 65.0868 53.7604 3.9202 24.9355 133.8010 10.4170 5.6535 1.4814 12.3631 2.7658 11.3636 7.8913 6.3975 3.8677 12.5839 8.4738 0.6568 5.2073 0.7737 2.2934 12.6688 2.8113 2.4533 1.2179 1.5023
temp: 298.150 k
press: 1.00000 atm
elementType: 8 8 7 6 6 6 6 6 6 6 6 6 6 6 6 6 1 1 1 1 1 1 1 1 1 1 1 1 1 1 1 1 1 1 1 1
symmnumber: 1
zpe: 803507.6 jmol-1
zpe.correction: 0.306040 hartree
zpe.thermalcorrener: 0.324394 hartree
zpe.thermalcorrenthalpy: 0.325339 hartree
zpe.thermalcorrgfe: 0.258265 hartree
zpe.sumelectzpe: -711.108895 hartree
zpe.sumelectthermal: -711.090541 hartree
zpe.sumelectthermalent: -711.089597 hartree
zpe.sumelectthermalfe: -711.156670 hartree
dipole: -1.1797 6.1563 -1.6325
dipole: 6.4774
quadrupole: -62.3757 -56.5168 -95.3643
quadrupole: -0.3943 -5.6868 3.3872
quadrupole: 9.0433 14.9021 -23.9454 -0.3943 -5.6868 3.3872
hfenergy: -711.4149351 hartree
pointgroup: C01 [X(C13H20N1O2)]
dipole: 0.6291127 2.3821878 0.6509057 debye
polarizability: 185.5569553|-4.6647814|163.6779035|-7.476514|0.8479257|104.5975608 unknown
InChI: InChI=1S/C13H20NO2/c1-9-7-10(2)13(16-11(3)15)12(8-9)14(4,5)6/h7-8H,1-6H3
charge 1 multiplicity 1
36 atoms
O  -1.595929 0.046139 0.565189
O  -2.439343 -0.801633 -1.462878
N  0.445089 2.066847 0.074163
C  0.766556 0.570404 0.062925
C  1.687673 2.938656 -0.123135
C  -0.166602 2.463638 1.430889
C  -0.521331 2.406972 -1.072567
C  -0.263768 -0.386157 0.273432
C  2.093307 0.141128 -0.148445
C  0.040802 -1.773992 0.303113
C  2.417165 -1.237192 -0.15372
C  1.380031 -2.168561 0.084168
C  -1.029225 -2.809957 0.575501
C  3.837936 -1.701476 -0.404975
C  -2.675045 -0.334496 -0.342555
C  -4.001152 -0.056507 0.308854
H  2.134117 2.735965 -1.106969
H  1.364692 3.989603 -0.076888
H  2.411191 2.742478 0.68051
H  0.57723 2.256924 2.214702
H  -0.406231 3.538174 1.403213
H  -1.070346 1.866135 1.601602
H  -1.467412 1.879141 -0.917582
H  -0.691025 3.494988 -1.076313
H  -0.064161 2.083569 -2.018993
H  2.903667 0.852957 -0.315284
H  1.618165 -3.238102 0.105686
H  -1.731005 -2.478772 1.36127
H  -1.617988 -3.01736 -0.33712
H  -0.575961 -3.758934 0.903262
H  4.15664 -2.442333 0.349344
H  3.923353 -2.190768 -1.393167
H  4.55782 -0.866559 -0.383836
H  -4.235584 -0.867257 1.023351
H  -4.792436 -0.026024 -0.454081
H  -3.981492 0.884659 0.881832
