program: Gaussian 16
title: Scaling factors
version: ES64L-G16RevC.01
frameworkgroup: C*V[C*(HF)]
method: RM062X
basis: 3-21G
operation: Freq
keyword: #N
keyword: Geom=AllCheck
keyword: Guess=TCheck
keyword: SCRF=Check
keyword: GenChk
keyword: RM062X/3-21G
keyword: Freq
converged: YES YES YES YES
title: Mulliken charges:
elementType: F H
charge: -0.412786 0.412786
chargesum: 0.00000
title: Mulliken charges with hydrogens summed into heavy atoms:
elementType: F
charge: 0.000000
1716.lowfreq: -77.6713 -77.6713 0.0013 0.0018 0.0018 3771.5475
frequency: 3771.5475
redmass: 1.0583
irintensity: 8.9567
temp: 298.150 k
press: 1.00000 atm
elementType: 9 1
symmnumber: 1
zpe: 22558.9 jmol-1
zpe.correction: 0.008592 hartree
zpe.thermalcorrener: 0.010953 hartree
zpe.thermalcorrenthalpy: 0.011897 hartree
zpe.thermalcorrgfe: -0.007895 hartree
zpe.sumelectzpe: -99.817556 hartree
zpe.sumelectthermal: -99.815196 hartree
zpe.sumelectthermalent: -99.814251 hartree
zpe.sumelectthermalfe: -99.834043 hartree
dipole: 0.0000 0.0000 -2.0697
dipole: 2.0697
quadrupole: -5.2094 -5.2094 -3.3129
quadrupole: 0.0000 0.0000 0.0000
quadrupole: -0.6322 -0.6322 1.2643 0.0000 0.0000 0.0000
hfenergy: -99.8261482 hartree
pointgroup: C*V [C*(H1F1)]
dipole: 0. 0. -0.8142925 debye
dipolederiv: -0.4478015 0. 0. 0. -0.4478015 0. 0. 0. -0.0937706 0.4478015 0. 0. 0. 0.4478015 0. 0. 0. 0.0937706 unknown
polarizability: 0.3847818|0.|0.3847818|0.|0.|4.3835083 unknown
InChI: InChI=1S/FH/h1H
charge 0 multiplicity 1
2 atoms
F  0.0000 0.0000 0.08710192
H  0.0000 0.0000 -0.87551292
