program: Gaussian 16
title: Scaling factors
version: ES64L-G16RevC.01
frameworkgroup: D*H[O(C),C*(O.O)]
method: RM062X
basis: 3-21G
operation: Freq
keyword: #N
keyword: Geom=AllCheck
keyword: Guess=TCheck
keyword: SCRF=Check
keyword: GenChk
keyword: RM062X/3-21G
keyword: Freq
converged: YES YES YES YES
title: Mulliken charges:
elementType: C O O
charge: 0.867357 -0.433679 -0.433679
chargesum: 0.00000
title: Mulliken charges with hydrogens summed into heavy atoms:
1716.lowfreq: 0.0007 0.0007 0.0009 12.5319 12.5319 591.4600 591.4600 1336.2162 2363.9797
frequency: 591.4600 591.4600 1336.2162 2363.9797
redmass: 12.8774 12.8774 15.9949 12.8774
irintensity: 31.6782 31.6782 0.0000 462.0378
temp: 298.150 k
press: 1.00000 atm
elementType: 6 8 8
symmnumber: 2
zpe: 29207.5 jmol-1
zpe.correction: 0.011125 hartree
zpe.thermalcorrener: 0.013824 hartree
zpe.thermalcorrenthalpy: 0.014768 hartree
zpe.thermalcorrgfe: -0.009631 hartree
zpe.sumelectzpe: -187.426564 hartree
zpe.sumelectthermal: -187.423865 hartree
zpe.sumelectthermalent: -187.422921 hartree
zpe.sumelectthermalfe: -187.447320 hartree
dipole: -0.0000 0.0000 -0.0000
dipole: 0.0000
quadrupole: -14.4842 -14.4842 -20.3405
quadrupole: 0.0000 0.0000 0.0000
quadrupole: 1.9521 1.9521 -3.9042 0.0000 0.0000 0.0000
hfenergy: -187.437689 hartree
pointgroup: D*H [O(C1),C*(O1.O1)]
dipole: 0. 0. 0. debye
dipolederiv: 0.5325066 0. 0. 0. 0.5325066 0. 0. 0. 2.0336845 -0.2662533 0. 0. 0. -0.2662533 0. 0. 0. -1.0168422 -0.2662533 0. 0. 0. -0.2662533 0. 0. 0. -1.0168422 unknown
polarizability: 5.144582|0.|5.144582|0.|0.|20.4324795 unknown
InChI: InChI=1S/CO2/c2-1-3
charge 0 multiplicity 1
3 atoms
C  0.0000 0.0000 0.0000
O  0.0000 0.0000 1.17710567
O  0.0000 0.0000 -1.17710567
